{"text_format":"1","workbook":"xlsx","n_sheets":18,"sheets":["Entries","1M Walk","50m","60m","75m","100m","120m","150m","200m","300m","400m","600m","800m","1500m","High Jump","Long Jump","Shot Putt","Discus"],"not_rendered":{"charts":0,"images":1,"macros":1,"external_links":1,"defined_names":5,"comments":0,"pivot_tables":0},"unopened":[],"bounds":{"document_bytes":16777216,"sheet_cells":100000,"rows_first":2000,"rows_last":500,"rows_between":2000,"halvings":0,"cell_chars":16384,"cell_head_chars":4096},"cells_cut":0,"cells_raw":0,"read":"whole","date_system":"1900"}

{"sheet":"Entries","index":0,"n_rows":687,"n_cols":14,"rows_kept":687,"cut":false,"hidden":true,"merged":[]}
["Entry number","Event","PB","Name","Surname","Club","Gender","Age on 31/08/2022","DOB","UKA","Licensed","Agegroup","Event","Entry ref"]
[1,"U13G_100m",15.2,"Maria Oreoluwa","Awoyode","Aldershot Farnham & District","F",11,"2013-04-26",4068270,1,"U13G","100m",349665]
[1,"U13G_200m",32.89,"Maria Oreoluwa","Awoyode","Aldershot Farnham & District","F",11,"2013-04-26",4068270,1,"U13G","200m",349665]
[1,"U13G_SP",5.8,"Maria Oreoluwa","Awoyode","Aldershot Farnham & District","F",11,"2013-04-26",4068270,1,"U13G","SP",349665]
[2,"U11G_75m",18,"Grace","Awoyode","Unattached","F",9,"2015-02-28",null,-1,"U11G","75m",349666]
[2,"U11G_150m",36,"Grace","Awoyode","Unattached","F",9,"2015-02-28",null,-1,"U11G","150m",349666]
{"$rows_left_out":682}
{"sheet":"1M Walk","index":1,"n_rows":42,"n_cols":16,"rows_kept":42,"cut":false,"hidden":false,"merged":[]}
["One Mile Walk"]
[]
["Veteran Men",null,null,null,null,null,null,null,null,"Veteran Women"]
["Pos","Number","Last Name","First Name","Age","Club","Time",null,null,"Pos","Number","Last Name","First Name","Age","Club","Time"]
[1,379,{"$f":"IFERROR(VLOOKUP(B5,Entries!$A:$E,5,0),\"-\")","v":"Barnard"},{"$f":"IFERROR(VLOOKUP(B5,Entries!$A:$D,4,0),\"-\")","v":"Philip"},{"$f":"IFERROR(VLOOKUP(B5,Entries!$A:$H,8,0),\"-\")","v":40},{"$f":"IFERROR(VLOOKUP(B5,Entries!$A:$F,6,0),\"-\")","v":"Ilford AC"},"00:07:36.400",null,null,1,384,"Dyos ","Emma ","W45","Brentwood ","00:08:44.900"]
[2,312,{"$f":"IFERROR(VLOOKUP(B6,Entries!$A:$E,5,0),\"-\")","v":"Bennett"},{"$f":"IFERROR(VLOOKUP(B6,Entries!$A:$D,4,0),\"-\")","v":"Stuart"},{"$f":"IFERROR(VLOOKUP(B6,Entries!$A:$H,8,0),\"-\")","v":66},{"$f":"IFERROR(VLOOKUP(B6,Entries!$A:$F,6,0),\"-\")","v":"Ilford AC"},"00:09:10.800",null,null,2,112,{"$f":"IFERROR(VLOOKUP(K6,Entries!$A:$E,5,0),\"-\")","v":"Mountford"},{"$f":"IFERROR(VLOOKUP(K6,Entries!$A:$D,4,0),\"-\")","v":"Linda"},{"$f":"IFERROR(VLOOKUP(K6,Entries!$A:$H,8,0),\"-\")","v":58},{"$f":"IFERROR(VLOOKUP(K6,Entries!$A:$F,6,0),\"-\")","v":"Unattached"},"00:09:57.800"]
{"$rows_left_out":37}
{"sheet":"50m","index":2,"n_rows":28,"n_cols":15,"rows_kept":28,"cut":false,"hidden":false,"merged":[]}
["50m","U11 Year 1 and 2"]
[]
["U9 Boys","Heat 1",null,null,null,"Wind",null,null,"U9 Girls",null,null,null,null,"Wind"]
["Pos","Number","Last Name","First Name","Age","Club","Time",null,"Pos","Number","Last Name","First Name","Age","Club","Time"]
[1,6,{"$f":"IFERROR(VLOOKUP(B5,Entries!$A:$E,5,0),\"-\")","v":"Brown"},{"$f":"IFERROR(VLOOKUP(B5,Entries!$A:$D,4,0),\"-\")","v":"Leo"},{"$f":"IFERROR(VLOOKUP(B5,Entries!$A:$H,8,0),\"-\")","v":6},{"$f":"IFERROR(VLOOKUP(B5,Entries!$A:$F,6,0),\"-\")","v":"SS Athletics"},9.93,null,1,10,{"$f":"IFERROR(VLOOKUP(J5,Entries!$A:$E,5,0),\"-\")","v":"Brewington"},{"$f":"IFERROR(VLOOKUP(J5,Entries!$A:$D,4,0),\"-\")","v":"Freya"},{"$f":"IFERROR(VLOOKUP(J5,Entries!$A:$H,8,0),\"-\")","v":5},{"$f":"IFERROR(VLOOKUP(J5,Entries!$A:$F,6,0),\"-\")","v":"Brentwood Beagles Athletics Club"},"NO TIME "]
[2,3,{"$f":"IFERROR(VLOOKUP(B6,Entries!$A:$E,5,0),\"-\")","v":"Awoyode"},{"$f":"IFERROR(VLOOKUP(B6,Entries!$A:$D,4,0),\"-\")","v":"Joseph"},{"$f":"IFERROR(VLOOKUP(B6,Entries!$A:$H,8,0),\"-\")","v":5},{"$f":"IFERROR(VLOOKUP(B6,Entries!$A:$F,6,0),\"-\")","v":"Unattached"},10.130000000000001,null,2,16,{"$f":"IFERROR(VLOOKUP(J6,Entries!$A:$E,5,0),\"-\")","v":"Ngala"},{"$f":"IFERROR(VLOOKUP(J6,Entries!$A:$D,4,0),\"-\")","v":"Meghan"},{"$f":"IFERROR(VLOOKUP(J6,Entries!$A:$H,8,0),\"-\")","v":5},{"$f":"IFERROR(VLOOKUP(J6,Entries!$A:$F,6,0),\"-\")","v":"Unattached"},"NO TIME "]
{"$rows_left_out":23}
{"sheet":"60m","index":3,"n_rows":28,"n_cols":15,"rows_kept":28,"cut":false,"hidden":false,"merged":[]}
["60m","U11 Year 1 and 2"]
[]
["U11 Boys",null,null,null,null,"Wind",null,null,"U11 Girls",null,null,null,null,"Wind"]
["Pos","Number","Last Name","First Name","Age","Club","Time",null,"Pos","Number","Last Name","First Name","Age","Club","Time"]
[1,68,{"$f":"IFERROR(VLOOKUP(B5,Entries!$A:$E,5,0),\"-\")","v":"Adenodi"},{"$f":"IFERROR(VLOOKUP(B5,Entries!$A:$D,4,0),\"-\")","v":"Ethan"},{"$f":"IFERROR(VLOOKUP(B5,Entries!$A:$H,8,0),\"-\")","v":8},{"$f":"IFERROR(VLOOKUP(B5,Entries!$A:$F,6,0),\"-\")","v":"SS Athletics"},"10.94",null,1,83,{"$f":"IFERROR(VLOOKUP(J5,Entries!$A:$E,5,0),\"-\")","v":"Wenn"},{"$f":"IFERROR(VLOOKUP(J5,Entries!$A:$D,4,0),\"-\")","v":"Olivia"},{"$f":"IFERROR(VLOOKUP(J5,Entries!$A:$H,8,0),\"-\")","v":7},{"$f":"IFERROR(VLOOKUP(J5,Entries!$A:$F,6,0),\"-\")","v":"SS Athletics"},"12.09"]
[2,313,{"$f":"IFERROR(VLOOKUP(B6,Entries!$A:$E,5,0),\"-\")","v":"Vaughan"},{"$f":"IFERROR(VLOOKUP(B6,Entries!$A:$D,4,0),\"-\")","v":"Brody"},{"$f":"IFERROR(VLOOKUP(B6,Entries!$A:$H,8,0),\"-\")","v":7},{"$f":"IFERROR(VLOOKUP(B6,Entries!$A:$F,6,0),\"-\")","v":"SS Athletics"},"11.21",null,2,336,{"$f":"IFERROR(VLOOKUP(J6,Entries!$A:$E,5,0),\"-\")","v":"Smith"},{"$f":"IFERROR(VLOOKUP(J6,Entries!$A:$D,4,0),\"-\")","v":"Willow"},{"$f":"IFERROR(VLOOKUP(J6,Entries!$A:$H,8,0),\"-\")","v":7},{"$f":"IFERROR(VLOOKUP(J6,Entries!$A:$F,6,0),\"-\")","v":"Brentwood Beagles Athletics Club"},"12.30"]
{"$rows_left_out":23}
{"sheet":"75m","index":4,"n_rows":48,"n_cols":16,"rows_kept":48,"cut":false,"hidden":false,"merged":[]}
["75m","U11 Year 3,4 & 5"]
[]
["U11 Boys Heat 1",null,null,null,null,"Wind",-4.5999999999999996,null,null,"U11 Girls Heat 1",null,null,null,null,"Wind"]
["Pos","Number","Last Name","First Name","Age","Club","Time",null,null,"Pos","Number","Last Name","First Name","Age","Club","Time"]
[1,304,{"$f":"IFERROR(VLOOKUP(B5,Entries!$A:$E,5,0),\"-\")","v":"Cole"},{"$f":"IFERROR(VLOOKUP(B5,Entries!$A:$D,4,0),\"-\")","v":"Tyatt"},{"$f":"IFERROR(VLOOKUP(B5,Entries!$A:$H,8,0),\"-\")","v":9},{"$f":"IFERROR(VLOOKUP(B5,Entries!$A:$F,6,0),\"-\")","v":"City of Southend On Sea AC"},"12.24",null,null,1,134,{"$f":"IFERROR(VLOOKUP(K5,Entries!$A:$E,5,0),\"-\")","v":"Perry"},{"$f":"IFERROR(VLOOKUP(K5,Entries!$A:$D,4,0),\"-\")","v":"Elsie"},{"$f":"IFERROR(VLOOKUP(K5,Entries!$A:$H,8,0),\"-\")","v":9},{"$f":"IFERROR(VLOOKUP(K5,Entries!$A:$F,6,0),\"-\")","v":"SS Athletics"},"13.04"]
[2,292,{"$f":"IFERROR(VLOOKUP(B6,Entries!$A:$E,5,0),\"-\")","v":"Smith"},{"$f":"IFERROR(VLOOKUP(B6,Entries!$A:$D,4,0),\"-\")","v":"Alex"},{"$f":"IFERROR(VLOOKUP(B6,Entries!$A:$H,8,0),\"-\")","v":9},{"$f":"IFERROR(VLOOKUP(B6,Entries!$A:$F,6,0),\"-\")","v":"Brentwood Beagles Athletics Club"},"12.49",null,null,2,111,{"$f":"IFERROR(VLOOKUP(K6,Entries!$A:$E,5,0),\"-\")","v":"Brook"},{"$f":"IFERROR(VLOOKUP(K6,Entries!$A:$D,4,0),\"-\")","v":"Edith"},{"$f":"IFERROR(VLOOKUP(K6,Entries!$A:$H,8,0),\"-\")","v":9},{"$f":"IFERROR(VLOOKUP(K6,Entries!$A:$F,6,0),\"-\")","v":"SS Athletics"},"13.07"]
{"$rows_left_out":43}
{"sheet":"100m","index":5,"n_rows":120,"n_cols":15,"rows_kept":120,"cut":false,"hidden":false,"merged":[]}
["100m"]
[]
["U13 Boys Heat 1",null,null,null,null,"Wind",-4.2,null,"U13 Girls Heat 1",null,null,null,null,"Wind"]
["Pos","Number","Last Name","First Name","Age","Club","Time",null,"Pos","Number","Last Name","First Name","Age","Club","Time"]
[1,40,{"$f":"IFERROR(VLOOKUP(B5,Entries!$A:$E,5,0),\"-\")","v":"Cheetham"},{"$f":"IFERROR(VLOOKUP(B5,Entries!$A:$D,4,0),\"-\")","v":"Max"},{"$f":"IFERROR(VLOOKUP(B5,Entries!$A:$H,8,0),\"-\")","v":11},{"$f":"IFERROR(VLOOKUP(B5,Entries!$A:$F,6,0),\"-\")","v":"Brentwood Beagles Athletics Club"},"14.29",null,1,77,{"$f":"IFERROR(VLOOKUP(J5,Entries!$A:$E,5,0),\"-\")","v":"Oladele"},{"$f":"IFERROR(VLOOKUP(J5,Entries!$A:$D,4,0),\"-\")","v":"Davina"},{"$f":"IFERROR(VLOOKUP(J5,Entries!$A:$H,8,0),\"-\")","v":11},{"$f":"IFERROR(VLOOKUP(J5,Entries!$A:$F,6,0),\"-\")","v":"Thurrock Harriers"},"14.43"]
[2,160,{"$f":"IFERROR(VLOOKUP(B6,Entries!$A:$E,5,0),\"-\")","v":"Phillips-Frontin"},{"$f":"IFERROR(VLOOKUP(B6,Entries!$A:$D,4,0),\"-\")","v":"Dylan"},{"$f":"IFERROR(VLOOKUP(B6,Entries!$A:$H,8,0),\"-\")","v":11},{"$f":"IFERROR(VLOOKUP(B6,Entries!$A:$F,6,0),\"-\")","v":"SS Athletics"},"15.44",null,2,151,{"$f":"IFERROR(VLOOKUP(J6,Entries!$A:$E,5,0),\"-\")","v":"Radley"},{"$f":"IFERROR(VLOOKUP(J6,Entries!$A:$D,4,0),\"-\")","v":"Lucia"},{"$f":"IFERROR(VLOOKUP(J6,Entries!$A:$H,8,0),\"-\")","v":11},{"$f":"IFERROR(VLOOKUP(J6,Entries!$A:$F,6,0),\"-\")","v":"SS Athletics"},"14.81"]
{"$rows_left_out":115}
{"sheet":"120m","index":6,"n_rows":12,"n_cols":15,"rows_kept":12,"cut":false,"hidden":false,"merged":[]}
["120m"]
[]
["U9 Boys Heat 1",null,null,null,null,"Wind",null,null,"U9 Girls Heat 1",null,null,null,null,"Wind"]
["Pos","Number","Last Name","First Name","Age","Club","Time",null,"Pos","Number","Last Name","First Name","Age","Club","Time"]
[1,7,{"$f":"IFERROR(VLOOKUP(B5,Entries!$A:$E,5,0),\"-\")","v":"Ngala"},{"$f":"IFERROR(VLOOKUP(B5,Entries!$A:$D,4,0),\"-\")","v":"Mya"},{"$f":"IFERROR(VLOOKUP(B5,Entries!$A:$H,8,0),\"-\")","v":7},{"$f":"IFERROR(VLOOKUP(B5,Entries!$A:$F,6,0),\"-\")","v":"Brentwood Beagles Athletics Club"},"15.49.48.15",null,1,156,{"$f":"IFERROR(VLOOKUP(J5,Entries!$A:$E,5,0),\"-\")","v":"Rayner"},{"$f":"IFERROR(VLOOKUP(J5,Entries!$A:$D,4,0),\"-\")","v":"Frankie"},{"$f":"IFERROR(VLOOKUP(J5,Entries!$A:$H,8,0),\"-\")","v":8},{"$f":"IFERROR(VLOOKUP(J5,Entries!$A:$F,6,0),\"-\")","v":"Herts Phoenix AC"},"15.43.21"]
[2,313,{"$f":"IFERROR(VLOOKUP(B6,Entries!$A:$E,5,0),\"-\")","v":"Vaughan"},{"$f":"IFERROR(VLOOKUP(B6,Entries!$A:$D,4,0),\"-\")","v":"Brody"},{"$f":"IFERROR(VLOOKUP(B6,Entries!$A:$H,8,0),\"-\")","v":7},{"$f":"IFERROR(VLOOKUP(B6,Entries!$A:$F,6,0),\"-\")","v":"SS Athletics"},"15.49.48.67",null,2,363,{"$f":"IFERROR(VLOOKUP(J6,Entries!$A:$E,5,0),\"-\")","v":"Gosling"},{"$f":"IFERROR(VLOOKUP(J6,Entries!$A:$D,4,0),\"-\")","v":"Elise"},{"$f":"IFERROR(VLOOKUP(J6,Entries!$A:$H,8,0),\"-\")","v":8},{"$f":"IFERROR(VLOOKUP(J6,Entries!$A:$F,6,0),\"-\")","v":"Brentwood Beagles Athletics Club"},"15.43.22"]
{"$rows_left_out":7}
{"sheet":"150m","index":7,"n_rows":48,"n_cols":15,"rows_kept":48,"cut":false,"hidden":false,"merged":[]}
["150m","U11 Year 3,4 & 5"]
[]
["U11 Boys Heat 1",null,null,null,null,"Wind",null,null,"U11 Girls Heat 1",null,null,null,null,"Wind"]
["Pos","Number","Last Name","First Name","Age","Club","Time",null,"Pos","Number","Last Name","First Name","Age","Club","Time"]
[1,162,{"$f":"IFERROR(VLOOKUP(B5,Entries!$A:$E,5,0),\"-\")","v":"Birnie"},{"$f":"IFERROR(VLOOKUP(B5,Entries!$A:$D,4,0),\"-\")","v":"Jack"},{"$f":"IFERROR(VLOOKUP(B5,Entries!$A:$H,8,0),\"-\")","v":9},{"$f":"IFERROR(VLOOKUP(B5,Entries!$A:$F,6,0),\"-\")","v":"Benfleet RC"},"24.97",null,1,166,{"$f":"IFERROR(VLOOKUP(J5,Entries!$A:$E,5,0),\"-\")","v":"Njogu"},{"$f":"IFERROR(VLOOKUP(J5,Entries!$A:$D,4,0),\"-\")","v":"Keziah"},{"$f":"IFERROR(VLOOKUP(J5,Entries!$A:$H,8,0),\"-\")","v":9},{"$f":"IFERROR(VLOOKUP(J5,Entries!$A:$F,6,0),\"-\")","v":"SS Athletics"},"25.98"]
[2,168,{"$f":"IFERROR(VLOOKUP(B6,Entries!$A:$E,5,0),\"-\")","v":"Blomfield"},{"$f":"IFERROR(VLOOKUP(B6,Entries!$A:$D,4,0),\"-\")","v":"Jack"},{"$f":"IFERROR(VLOOKUP(B6,Entries!$A:$H,8,0),\"-\")","v":9},{"$f":"IFERROR(VLOOKUP(B6,Entries!$A:$F,6,0),\"-\")","v":"SS Athletics"},"25.50",null,2,134,{"$f":"IFERROR(VLOOKUP(J6,Entries!$A:$E,5,0),\"-\")","v":"Perry"},{"$f":"IFERROR(VLOOKUP(J6,Entries!$A:$D,4,0),\"-\")","v":"Elsie"},{"$f":"IFERROR(VLOOKUP(J6,Entries!$A:$H,8,0),\"-\")","v":9},{"$f":"IFERROR(VLOOKUP(J6,Entries!$A:$F,6,0),\"-\")","v":"SS Athletics"},"26.25"]
{"$rows_left_out":43}
{"sheet":"200m","index":8,"n_rows":103,"n_cols":15,"rows_kept":103,"cut":false,"hidden":false,"merged":[]}
["200m"]
[]
["U13 Boys Heat 1",null,null,null,null,"Wind",-4.5,null,"U13 Girls Heat 1",null,null,null,null,"Wind",-4.0999999999999996]
["Pos","Number","Last Name","First Name","Age","Club","Time",null,"Pos","Number","Last Name","First Name","Age","Club","Time"]
[1,65,{"$f":"IFERROR(VLOOKUP(B5,Entries!$A:$E,5,0),\"-\")","v":"Hay"},{"$f":"IFERROR(VLOOKUP(B5,Entries!$A:$D,4,0),\"-\")","v":"Logan"},{"$f":"IFERROR(VLOOKUP(B5,Entries!$A:$H,8,0),\"-\")","v":12},{"$f":"IFERROR(VLOOKUP(B5,Entries!$A:$F,6,0),\"-\")","v":"SS Athletics"},"27.56",null,1,276,{"$f":"IFERROR(VLOOKUP(J5,Entries!$A:$E,5,0),\"-\")","v":"Martell-Smith"},{"$f":"IFERROR(VLOOKUP(J5,Entries!$A:$D,4,0),\"-\")","v":"Lacey"},{"$f":"IFERROR(VLOOKUP(J5,Entries!$A:$H,8,0),\"-\")","v":11},{"$f":"IFERROR(VLOOKUP(J5,Entries!$A:$F,6,0),\"-\")","v":"Colchester Harriers AC"},"29.95"]
[2,40,{"$f":"IFERROR(VLOOKUP(B6,Entries!$A:$E,5,0),\"-\")","v":"Cheetham"},{"$f":"IFERROR(VLOOKUP(B6,Entries!$A:$D,4,0),\"-\")","v":"Max"},{"$f":"IFERROR(VLOOKUP(B6,Entries!$A:$H,8,0),\"-\")","v":11},{"$f":"IFERROR(VLOOKUP(B6,Entries!$A:$F,6,0),\"-\")","v":"Brentwood Beagles Athletics Club"},"29.08",null,2,283,{"$f":"IFERROR(VLOOKUP(J6,Entries!$A:$E,5,0),\"-\")","v":"Freese"},{"$f":"IFERROR(VLOOKUP(J6,Entries!$A:$D,4,0),\"-\")","v":"Zara"},{"$f":"IFERROR(VLOOKUP(J6,Entries!$A:$H,8,0),\"-\")","v":11},{"$f":"IFERROR(VLOOKUP(J6,Entries!$A:$F,6,0),\"-\")","v":"SS Athletics"},"30.13"]
{"$rows_left_out":98}
{"sheet":"300m","index":9,"n_rows":24,"n_cols":15,"rows_kept":24,"cut":false,"hidden":false,"merged":[]}
["300m"]
[]
["U15 Boys",null,null,null,null,null,null,null,"U15 Girls"]
["Pos","Number","Last Name","First Name","Age","Club","Time",null,"Pos","Number","Last Name","First Name","Age","Club","Time"]
[1,63,{"$f":"IFERROR(VLOOKUP(B5,Entries!$A:$E,5,0),\"-\")","v":"Hill"},{"$f":"IFERROR(VLOOKUP(B5,Entries!$A:$D,4,0),\"-\")","v":"George"},{"$f":"IFERROR(VLOOKUP(B5,Entries!$A:$H,8,0),\"-\")","v":13},{"$f":"IFERROR(VLOOKUP(B5,Entries!$A:$F,6,0),\"-\")","v":"City of Southend On Sea AC"},"43.34",null,1,62,{"$f":"IFERROR(VLOOKUP(J5,Entries!$A:$E,5,0),\"-\")","v":"Barker"},{"$f":"IFERROR(VLOOKUP(J5,Entries!$A:$D,4,0),\"-\")","v":"Isla"},{"$f":"IFERROR(VLOOKUP(J5,Entries!$A:$H,8,0),\"-\")","v":14},{"$f":"IFERROR(VLOOKUP(J5,Entries!$A:$F,6,0),\"-\")","v":"Ipswich Harriers"},"43.33"]
[2,250,{"$f":"IFERROR(VLOOKUP(B6,Entries!$A:$E,5,0),\"-\")","v":"Weston"},{"$f":"IFERROR(VLOOKUP(B6,Entries!$A:$D,4,0),\"-\")","v":"Jack"},{"$f":"IFERROR(VLOOKUP(B6,Entries!$A:$H,8,0),\"-\")","v":14},{"$f":"IFERROR(VLOOKUP(B6,Entries!$A:$F,6,0),\"-\")","v":"Basildon AC"},"43.98",null,2,234,{"$f":"IFERROR(VLOOKUP(J6,Entries!$A:$E,5,0),\"-\")","v":"Carter"},{"$f":"IFERROR(VLOOKUP(J6,Entries!$A:$D,4,0),\"-\")","v":"Ava"},{"$f":"IFERROR(VLOOKUP(J6,Entries!$A:$H,8,0),\"-\")","v":14},{"$f":"IFERROR(VLOOKUP(J6,Entries!$A:$F,6,0),\"-\")","v":"Brentwood Beagles Athletics Club"},"43.53"]
{"$rows_left_out":19}
{"sheet":"400m","index":10,"n_rows":64,"n_cols":19,"rows_kept":64,"cut":false,"hidden":false,"merged":[]}
["400m"]
[]
["U9B",null,null,null,null,null,null,null,null,null,"U9G Heat 1"]
["Pos","Number","Last Name","First Name","Age","Club","Time",null,null,null,"Pos","Number","Last Name","First Name","Age","Club","Time"]
[1,142,{"$f":"IFERROR(VLOOKUP(B5,Entries!$A:$E,5,0),\"-\")","v":"Pearce"},{"$f":"IFERROR(VLOOKUP(B5,Entries!$A:$D,4,0),\"-\")","v":"Jake"},{"$f":"IFERROR(VLOOKUP(B5,Entries!$A:$H,8,0),\"-\")","v":8},{"$f":"IFERROR(VLOOKUP(B5,Entries!$A:$F,6,0),\"-\")","v":"SS Athletics"},"1.15.3",null,null,null,1,194,{"$f":"IFERROR(VLOOKUP(L5,Entries!$A:$E,5,0),\"-\")","v":"Cassidy-George"},{"$f":"IFERROR(VLOOKUP(L5,Entries!$A:$D,4,0),\"-\")","v":"Lois"},{"$f":"IFERROR(VLOOKUP(L5,Entries!$A:$H,8,0),\"-\")","v":8},{"$f":"IFERROR(VLOOKUP(L5,Entries!$A:$F,6,0),\"-\")","v":"SS Athletics"},"1.20.65"]
[2,152,{"$f":"IFERROR(VLOOKUP(B6,Entries!$A:$E,5,0),\"-\")","v":"Finnegan"},{"$f":"IFERROR(VLOOKUP(B6,Entries!$A:$D,4,0),\"-\")","v":"Teddy"},{"$f":"IFERROR(VLOOKUP(B6,Entries!$A:$H,8,0),\"-\")","v":8},{"$f":"IFERROR(VLOOKUP(B6,Entries!$A:$F,6,0),\"-\")","v":"SS Athletics"},"1.16.2",null,null,null,2,90,{"$f":"IFERROR(VLOOKUP(L6,Entries!$A:$E,5,0),\"-\")","v":"Foy"},{"$f":"IFERROR(VLOOKUP(L6,Entries!$A:$D,4,0),\"-\")","v":"Rosie"},{"$f":"IFERROR(VLOOKUP(L6,Entries!$A:$H,8,0),\"-\")","v":8},{"$f":"IFERROR(VLOOKUP(L6,Entries!$A:$F,6,0),\"-\")","v":"SS Athletics"},"1.24.65"]
{"$rows_left_out":59}
{"sheet":"600m","index":11,"n_rows":31,"n_cols":15,"rows_kept":31,"cut":false,"hidden":false,"merged":[]}
["600m","U11 Year 3,4 & 5"]
[]
["U11 Boys Heat 1",null,null,null,null,null,null,null,"U11 Girls Heat 1"]
["Pos","Number","Last Name","First Name","Age","Club","Time",null,"Pos","Number","Last Name","First Name","Age","Club","Time"]
[1,55,{"$f":"IFERROR(VLOOKUP(B5,Entries!$A:$E,5,0),\"-\")","v":"Thompson"},{"$f":"IFERROR(VLOOKUP(B5,Entries!$A:$D,4,0),\"-\")","v":"Rocco"},{"$f":"IFERROR(VLOOKUP(B5,Entries!$A:$H,8,0),\"-\")","v":9},{"$f":"IFERROR(VLOOKUP(B5,Entries!$A:$F,6,0),\"-\")","v":"SS Athletics"},"1.57.81",null,1,42,{"$f":"IFERROR(VLOOKUP(J5,Entries!$A:$E,5,0),\"-\")","v":"Burrows"},{"$f":"IFERROR(VLOOKUP(J5,Entries!$A:$D,4,0),\"-\")","v":"Honor"},{"$f":"IFERROR(VLOOKUP(J5,Entries!$A:$H,8,0),\"-\")","v":9},{"$f":"IFERROR(VLOOKUP(J5,Entries!$A:$F,6,0),\"-\")","v":"SS Athletics"},"2.03.90"]
[2,338,{"$f":"IFERROR(VLOOKUP(B6,Entries!$A:$E,5,0),\"-\")","v":"Geller"},{"$f":"IFERROR(VLOOKUP(B6,Entries!$A:$D,4,0),\"-\")","v":"Jesse"},{"$f":"IFERROR(VLOOKUP(B6,Entries!$A:$H,8,0),\"-\")","v":9},{"$f":"IFERROR(VLOOKUP(B6,Entries!$A:$F,6,0),\"-\")","v":"Woodford Green AC with Essex Ladies"},"2.02.81",null,2,103,{"$f":"IFERROR(VLOOKUP(J6,Entries!$A:$E,5,0),\"-\")","v":"Townsend"},{"$f":"IFERROR(VLOOKUP(J6,Entries!$A:$D,4,0),\"-\")","v":"Ronni"},{"$f":"IFERROR(VLOOKUP(J6,Entries!$A:$H,8,0),\"-\")","v":9},{"$f":"IFERROR(VLOOKUP(J6,Entries!$A:$F,6,0),\"-\")","v":"Colchester & Tendring AC"},"2.06.26"]
{"$rows_left_out":26}
{"sheet":"800m","index":12,"n_rows":83,"n_cols":16,"rows_kept":83,"cut":false,"hidden":false,"merged":[]}
["800m"]
[]
["U13 Boys",null,null,null,null,null,null,null,"U13 Girls"]
["Pos","Number","Last Name","First Name","Age","Club","Time",null,"Pos","Number","Last Name","First Name","Age","Club","Time"]
[1,5,{"$f":"IFERROR(VLOOKUP(B5,Entries!$A:$E,5,0),\"-\")","v":"Brown"},{"$f":"IFERROR(VLOOKUP(B5,Entries!$A:$D,4,0),\"-\")","v":"Samuel"},{"$f":"IFERROR(VLOOKUP(B5,Entries!$A:$H,8,0),\"-\")","v":11},{"$f":"IFERROR(VLOOKUP(B5,Entries!$A:$F,6,0),\"-\")","v":"SS Athletics"},"2.26.12",null,1,317,{"$f":"IFERROR(VLOOKUP(J5,Entries!$A:$E,5,0),\"-\")","v":"Kindler"},{"$f":"IFERROR(VLOOKUP(J5,Entries!$A:$D,4,0),\"-\")","v":"Madison"},{"$f":"IFERROR(VLOOKUP(J5,Entries!$A:$H,8,0),\"-\")","v":11},{"$f":"IFERROR(VLOOKUP(J5,Entries!$A:$F,6,0),\"-\")","v":"Brentwood Beagles Athletics Club"},"2.22.3"]
[2,218,{"$f":"IFERROR(VLOOKUP(B6,Entries!$A:$E,5,0),\"-\")","v":"Haynes"},{"$f":"IFERROR(VLOOKUP(B6,Entries!$A:$D,4,0),\"-\")","v":"Dexter"},{"$f":"IFERROR(VLOOKUP(B6,Entries!$A:$H,8,0),\"-\")","v":12},{"$f":"IFERROR(VLOOKUP(B6,Entries!$A:$F,6,0),\"-\")","v":"SS Athletics"},"2.40.97",null,2,159,{"$f":"IFERROR(VLOOKUP(J6,Entries!$A:$E,5,0),\"-\")","v":"Carver"},{"$f":"IFERROR(VLOOKUP(J6,Entries!$A:$D,4,0),\"-\")","v":"Katie"},{"$f":"IFERROR(VLOOKUP(J6,Entries!$A:$H,8,0),\"-\")","v":12},{"$f":"IFERROR(VLOOKUP(J6,Entries!$A:$F,6,0),\"-\")","v":"SS Athletics"},"2.38.3"]
{"$rows_left_out":78}
{"sheet":"1500m","index":13,"n_rows":71,"n_cols":15,"rows_kept":71,"cut":false,"hidden":false,"merged":[]}
["1500m"]
[]
["U13 Boys",null,null,null,null,null,null,null,"U13 Girls"]
["Pos","Number","Last Name","First Name","Age","Club","Time",null,"Pos","Number","Last Name","First Name","Age","Club","Time"]
[1,115,{"$f":"IFERROR(VLOOKUP(B5,Entries!$A:$E,5,0),\"-\")","v":"Smith"},{"$f":"IFERROR(VLOOKUP(B5,Entries!$A:$D,4,0),\"-\")","v":"Charlie"},{"$f":"IFERROR(VLOOKUP(B5,Entries!$A:$H,8,0),\"-\")","v":12},{"$f":"IFERROR(VLOOKUP(B5,Entries!$A:$F,6,0),\"-\")","v":"SS Athletics"},"5.03.93",null,1,51,{"$f":"IFERROR(VLOOKUP(J5,Entries!$A:$E,5,0),\"-\")","v":"Owen"},{"$f":"IFERROR(VLOOKUP(J5,Entries!$A:$D,4,0),\"-\")","v":"Sadie"},{"$f":"IFERROR(VLOOKUP(J5,Entries!$A:$H,8,0),\"-\")","v":12},{"$f":"IFERROR(VLOOKUP(J5,Entries!$A:$F,6,0),\"-\")","v":"SS Athletics"},"5.21.74"]
[2,98,{"$f":"IFERROR(VLOOKUP(B6,Entries!$A:$E,5,0),\"-\")","v":"Lupton"},{"$f":"IFERROR(VLOOKUP(B6,Entries!$A:$D,4,0),\"-\")","v":"Oliver"},{"$f":"IFERROR(VLOOKUP(B6,Entries!$A:$H,8,0),\"-\")","v":11},{"$f":"IFERROR(VLOOKUP(B6,Entries!$A:$F,6,0),\"-\")","v":"SS Athletics"},"5.04.33",null,2,175,{"$f":"IFERROR(VLOOKUP(J6,Entries!$A:$E,5,0),\"-\")","v":"Sabado"},{"$f":"IFERROR(VLOOKUP(J6,Entries!$A:$D,4,0),\"-\")","v":"Aria"},{"$f":"IFERROR(VLOOKUP(J6,Entries!$A:$H,8,0),\"-\")","v":12},{"$f":"IFERROR(VLOOKUP(J6,Entries!$A:$F,6,0),\"-\")","v":"Brentwood Beagles Athletics Club"},"5.35.42"]
{"$rows_left_out":66}
{"sheet":"High Jump","index":14,"n_rows":61,"n_cols":17,"rows_kept":61,"cut":false,"hidden":false,"merged":[]}
["High Jump"]
[]
[]
[]
["U13 Boys",null,null,null,null,null,null,null,null,"U13 Girls"]
["Pos","Number","Last Name","First Name","Age","Club","Distance","Wind",null,"Pos","Number","Last Name","First Name","Age","Club","Distance","Wind"]
{"$rows_left_out":56}
{"sheet":"Long Jump","index":15,"n_rows":110,"n_cols":17,"rows_kept":110,"cut":false,"hidden":false,"merged":[]}
["Long Jump"]
["U11 Boys (Yr4)",null,null,null,null,null,null,null,null,"U11 Girls Yr4"]
["Pos","Number","Last Name","First Name","Age","Club","Distance",null,null,"Pos","Number","Last Name","First Name","Age","Club","Distance","Wind"]
[1,84,{"$f":"IFERROR(VLOOKUP(B4,Entries!$A:$E,5,0),\"-\")","v":"Brazier"},{"$f":"IFERROR(VLOOKUP(B4,Entries!$A:$D,4,0),\"-\")","v":"James"},{"$f":"IFERROR(VLOOKUP(B4,Entries!$A:$H,8,0),\"-\")","v":9},{"$f":"IFERROR(VLOOKUP(B4,Entries!$A:$F,6,0),\"-\")","v":"SS Athletics"},"3.76",null,null,1,310,{"$f":"IFERROR(VLOOKUP(K4,Entries!$A:$E,5,0),\"-\")","v":"Lewis"},{"$f":"IFERROR(VLOOKUP(K4,Entries!$A:$D,4,0),\"-\")","v":"Emily"},{"$f":"IFERROR(VLOOKUP(K4,Entries!$A:$H,8,0),\"-\")","v":9},{"$f":"IFERROR(VLOOKUP(K4,Entries!$A:$F,6,0),\"-\")","v":"City of Southend On Sea AC"},"3.86"]
[2,304,{"$f":"IFERROR(VLOOKUP(B5,Entries!$A:$E,5,0),\"-\")","v":"Cole"},{"$f":"IFERROR(VLOOKUP(B5,Entries!$A:$D,4,0),\"-\")","v":"Tyatt"},{"$f":"IFERROR(VLOOKUP(B5,Entries!$A:$H,8,0),\"-\")","v":9},{"$f":"IFERROR(VLOOKUP(B5,Entries!$A:$F,6,0),\"-\")","v":"City of Southend On Sea AC"},"3.71",null,null,2,265,{"$f":"IFERROR(VLOOKUP(K5,Entries!$A:$E,5,0),\"-\")","v":"Hatt"},{"$f":"IFERROR(VLOOKUP(K5,Entries!$A:$D,4,0),\"-\")","v":"Jessica"},{"$f":"IFERROR(VLOOKUP(K5,Entries!$A:$H,8,0),\"-\")","v":9},{"$f":"IFERROR(VLOOKUP(K5,Entries!$A:$F,6,0),\"-\")","v":"SS Athletics"},"3.42"]
[3,88,{"$f":"IFERROR(VLOOKUP(B6,Entries!$A:$E,5,0),\"-\")","v":"Stammers"},{"$f":"IFERROR(VLOOKUP(B6,Entries!$A:$D,4,0),\"-\")","v":"Rafael"},{"$f":"IFERROR(VLOOKUP(B6,Entries!$A:$H,8,0),\"-\")","v":9},{"$f":"IFERROR(VLOOKUP(B6,Entries!$A:$F,6,0),\"-\")","v":"Unattached"},"3.56",null,null,3,111,{"$f":"IFERROR(VLOOKUP(K6,Entries!$A:$E,5,0),\"-\")","v":"Brook"},{"$f":"IFERROR(VLOOKUP(K6,Entries!$A:$D,4,0),\"-\")","v":"Edith"},{"$f":"IFERROR(VLOOKUP(K6,Entries!$A:$H,8,0),\"-\")","v":9},{"$f":"IFERROR(VLOOKUP(K6,Entries!$A:$F,6,0),\"-\")","v":"SS Athletics"},"3.32"]
{"$rows_left_out":105}
{"sheet":"Shot Putt","index":16,"n_rows":84,"n_cols":15,"rows_kept":84,"cut":false,"hidden":false,"merged":[]}
["Shot Putt"]
[]
[null,null,null,null,null,null,null,null,"U13 Girls"]
[null,null,null,null,null,null,null,null,"Pos","Number","Last Name","First Name","Age","Club","Distance"]
[null,null,null,null,null,null,null,null,1,154,{"$f":"IFERROR(VLOOKUP(J5,Entries!$A:$E,5,0),\"-\")","v":"Osei"},{"$f":"IFERROR(VLOOKUP(J5,Entries!$A:$D,4,0),\"-\")","v":"Oluwatimileyin Elizabeth"},{"$f":"IFERROR(VLOOKUP(J5,Entries!$A:$H,8,0),\"-\")","v":12},{"$f":"IFERROR(VLOOKUP(J5,Entries!$A:$F,6,0),\"-\")","v":"Chelmsford AC"},"8.42"]
[null,null,null,null,null,null,null,null,2,77,{"$f":"IFERROR(VLOOKUP(J6,Entries!$A:$E,5,0),\"-\")","v":"Oladele"},{"$f":"IFERROR(VLOOKUP(J6,Entries!$A:$D,4,0),\"-\")","v":"Davina"},{"$f":"IFERROR(VLOOKUP(J6,Entries!$A:$H,8,0),\"-\")","v":11},{"$f":"IFERROR(VLOOKUP(J6,Entries!$A:$F,6,0),\"-\")","v":"Thurrock Harriers"},"8.39"]
{"$rows_left_out":79}
{"sheet":"Discus","index":17,"n_rows":84,"n_cols":15,"rows_kept":84,"cut":false,"hidden":false,"merged":[]}
["Discus"]
[]
["U13 Boys",null,null,null,null,null,null,null,"U13 Girls"]
["Pos","Number","Last Name","First Name","Age","Club","Distance",null,"Pos","Number","Last Name","First Name","Age","Club","Distance"]
[1,119,{"$f":"IFERROR(VLOOKUP(B5,Entries!$A:$E,5,0),\"-\")","v":"Petherbridge"},{"$f":"IFERROR(VLOOKUP(B5,Entries!$A:$D,4,0),\"-\")","v":"Zac"},{"$f":"IFERROR(VLOOKUP(B5,Entries!$A:$H,8,0),\"-\")","v":12},{"$f":"IFERROR(VLOOKUP(B5,Entries!$A:$F,6,0),\"-\")","v":"SS Athletics"},"28.33",null,1,216,{"$f":"IFERROR(VLOOKUP(J5,Entries!$A:$E,5,0),\"-\")","v":"Arnold"},{"$f":"IFERROR(VLOOKUP(J5,Entries!$A:$D,4,0),\"-\")","v":"Jessica"},{"$f":"IFERROR(VLOOKUP(J5,Entries!$A:$H,8,0),\"-\")","v":12},{"$f":"IFERROR(VLOOKUP(J5,Entries!$A:$F,6,0),\"-\")","v":"Brentwood Beagles Athletics Club"},"21.32"]
[2,8,{"$f":"IFERROR(VLOOKUP(B6,Entries!$A:$E,5,0),\"-\")","v":"Armour"},{"$f":"IFERROR(VLOOKUP(B6,Entries!$A:$D,4,0),\"-\")","v":"Adam"},{"$f":"IFERROR(VLOOKUP(B6,Entries!$A:$H,8,0),\"-\")","v":12},{"$f":"IFERROR(VLOOKUP(B6,Entries!$A:$F,6,0),\"-\")","v":"Brentwood Beagles Athletics Club"},"18.09",null,2,181,{"$f":"IFERROR(VLOOKUP(J6,Entries!$A:$E,5,0),\"-\")","v":"Williams"},{"$f":"IFERROR(VLOOKUP(J6,Entries!$A:$D,4,0),\"-\")","v":"Zenobia"},{"$f":"IFERROR(VLOOKUP(J6,Entries!$A:$H,8,0),\"-\")","v":12},{"$f":"IFERROR(VLOOKUP(J6,Entries!$A:$F,6,0),\"-\")","v":"Havering AC"},"20.48"]
{"$rows_left_out":78}