{"text_format":"1","workbook":"xlsx","n_sheets":18,"sheets":["Entries","1M Walk","50m","60m","75m","100m","120m","150m","200m","300m","400m","600m","800m","1500m","High Jump","Long Jump","Shot Putt","Discus"],"not_rendered":{"charts":0,"images":1,"macros":1,"external_links":1,"defined_names":5,"comments":0,"pivot_tables":0},"unopened":[],"bounds":{"document_bytes":16777216,"sheet_cells":100000,"rows_first":2000,"rows_last":500,"rows_between":2000,"halvings":0,"cell_chars":16384,"cell_head_chars":4096},"cells_cut":0,"cells_raw":0,"read":"whole","date_system":"1900"}

{"sheet":"Entries","index":0,"n_rows":687,"n_cols":14,"rows_kept":687,"cut":false,"hidden":true,"merged":[]}
["Entry number","Event","PB","Name","Surname","Club","Gender","Age on 31/08/2022","DOB","UKA","Licensed","Agegroup","Event","Entry ref"]
[1,"U13G_100m",15.2,"Maria Oreoluwa","Awoyode","Aldershot Farnham & District","F",11,"2013-04-26",4068270,1,"U13G","100m",349665]
[1,"U13G_200m",32.89,"Maria Oreoluwa","Awoyode","Aldershot Farnham & District","F",11,"2013-04-26",4068270,1,"U13G","200m",349665]
[1,"U13G_SP",5.8,"Maria Oreoluwa","Awoyode","Aldershot Farnham & District","F",11,"2013-04-26",4068270,1,"U13G","SP",349665]
[2,"U11G_75m",18,"Grace","Awoyode","Unattached","F",9,"2015-02-28",null,-1,"U11G","75m",349666]
[2,"U11G_150m",36,"Grace","Awoyode","Unattached","F",9,"2015-02-28",null,-1,"U11G","150m",349666]
[3,"U7B_50m",15,"Joseph","Awoyode","Unattached","M",5,"2018-12-30",null,1,"U7B","50m",350647]
[4,"U11G_150m",0.24,"Grace","Bell","Wirral AC","F",9,"2015-01-02",null,-1,"U11G","150m",350660]
[4,"U11G_600m","00:02:04","Grace","Bell","Wirral AC","F",9,"2015-01-02",null,-1,"U11G","600m",350660]
[5,"U13B_800m","00:02:25","Samuel","Brown","SS Athletics","M",11,"2013-04-23",4122828,1,"U13B","800m",350950]
[6,"U7B_50m","0.10.00","Leo","Brown","SS Athletics","M",6,"2017-09-05",null,1,"U7B","50m",350953]
[7,"U9G_60m",0,"Mya","Ngala","Brentwood Beagles Athletics Club","F",7,"2017-06-17",null,-1,"U9G","60m",351193]
[7,"U9G_120m",0,"Mya","Ngala","Brentwood Beagles Athletics Club","F",7,"2017-06-17",null,-1,"U9G","120m",351193]
[8,"U13B_800m","00:02:35","Adam","Armour","Brentwood Beagles Athletics Club","M",12,"2012-07-19",4073741,1,"U13B","800m",351207]
[8,"U13B_HJ",1.25,"Adam","Armour","Brentwood Beagles Athletics Club","M",12,"2012-07-19",4073741,1,"U13B","HJ",351207]
[8,"U13B_DT",19,"Adam","Armour","Brentwood Beagles Athletics Club","M",12,"2012-07-19",4073741,1,"U13B","DT",351207]
[9,"U11G_150m",0.28000000000000003,"Emily","Brewington","Brentwood Beagles Athletics Club","F",10,"2014-06-27",4132671,1,"U11G","150m",351224]
[9,"U11G_600m","00:02:10","Emily","Brewington","Brentwood Beagles Athletics Club","F",10,"2014-06-27",4132671,1,"U11G","600m",351224]
[9,"U11G_LJ",2.8,"Emily","Brewington","Brentwood Beagles Athletics Club","F",10,"2014-06-27",4132671,1,"U11G","LJ",351224]
[10,"U7G_50m",0.13,"Freya","Brewington","Brentwood Beagles Athletics Club","F",5,"2018-10-03",null,-1,"U7G","50m",351226]
[11,"U13G_100m",13.51,"Emma","Frisby","City of Southend On Sea AC","F",12,"2011-11-05",4049777,1,"U13G","100m",351291]
[11,"U13G_LJ",4.67,"Emma","Frisby","City of Southend On Sea AC","F",12,"2011-11-05",4049777,1,"U13G","LJ",351291]
[11,"U13G_HJ",1.5,"Emma","Frisby","City of Southend On Sea AC","F",12,"2011-11-05",4049777,1,"U13G","HJ",351291]
[12,"U15G_800m","00:02:31.100","Florence","Wallace","City of Southend On Sea AC","F",14,"2009-09-28",4089587,1,"U15G","800m",351307]
[13,"VW_DT",12.8,"Stephanie","Stamp","City of Southend On Sea AC","F",72,"1952-07-01",3243500,3243500,"VW","DT",351316]
[13,"VW_SP",5.8,"Stephanie","Stamp","City of Southend On Sea AC","F",72,"1952-07-01",3243500,3243500,"VW","SP",351316]
[14,"U20M_100m",1,"Tobi","Ekerin","Basildon AC","M",18,"2006-03-09",3545170,1,"U20M","100m",351468]
[14,"U20M_200m",1,"Tobi","Ekerin","Basildon AC","M",18,"2006-03-09",3545170,1,"U20M","200m",351468]
[15,"U11G_75m",1,"Temitope","Ekerin","Unattached","F",10,"2013-12-04",null,-1,"U11G","75m",351469]
[15,"U11G_150m",1,"Temitope","Ekerin","Unattached","F",10,"2013-12-04",null,-1,"U11G","150m",351469]
[15,"U11G_LJ",1,"Temitope","Ekerin","Unattached","F",10,"2013-12-04",null,-1,"U11G","LJ",351469]
[16,"U7G_50m",1,"Meghan","Ngala","Unattached","F",5,"2019-06-25",null,1,"U7G","50m",351472]
[17,"U20W_DT",35,"Katie","Ennis","Havering AC","F",19,"2005-10-19",3645965,1,"U20W","DT",351536]
[18,"U15G_200m",30.2,"Stevie","Makepeace","City of Southend On Sea AC","F",13,"2010-09-14",4048989,1,"U15G","200m",351732]
[18,"U15G_DT",18,"Stevie","Makepeace","City of Southend On Sea AC","F",13,"2010-09-14",4048989,1,"U15G","DT",351732]
[18,"U15G_SP",6.5,"Stevie","Makepeace","City of Southend On Sea AC","F",13,"2010-09-14",4048989,1,"U15G","SP",351732]
[19,"VM_1500m","00:04:45","David","Raffaelli","Leigh-on-Sea Striders","M",39,"1984-12-17",4019710,1,"VM","1500m",351774]
[20,"U17W_100m",12.6,"Erin","Frisby","City of Southend On Sea AC","F",15,"2009-04-22",4087012,1,"U17W","100m",351087]
[20,"U17W_200m",27,"Erin","Frisby","City of Southend On Sea AC","F",15,"2009-04-22",4087012,1,"U17W","200m",351087]
[21,"U7B_50m","2.10.32","Reuben","Druce","City of Southend On Sea AC","M",5,"2018-10-31",null,-1,"U7B","50m",352034]
[22,"U13G_100m",14,"Amenze","Amadin","City of Southend On Sea AC","F",12,"2012-06-04",4099383,1,"U13G","100m",352047]
[22,"U13G_800m","00:03:10","Amenze","Amadin","City of Southend On Sea AC","F",12,"2012-06-04",4099383,1,"U13G","800m",352047]
[23,"U15G_300m",42,"Evanna","Eze","Woodford Green AC with Essex Ladies","F",14,"2009-09-30",4034162,1,"U15G","300m",352092]
[24,"U17W_300m",43,"Evie-Mae","Mosanya","Woodford Green AC with Essex Ladies","F",15,"2009-07-26",4087568,1,"U17W","300m",352093]
[25,"U7B_50m",0,"Henry","Gray","City of Southend On Sea AC","M",6,"2017-09-06",null,-1,"U7B","50m",352103]
[26,"U13G_1500m","00:07:00","Poppy","Rolfe","SS Athletics","F",12,"2011-11-24",4101637,1,"U13G","1500m",352221]
[26,"U13G_LJ",3.5,"Poppy","Rolfe","SS Athletics","F",12,"2011-11-24",4101637,1,"U13G","LJ",352221]
[26,"U13G_SP",5,"Poppy","Rolfe","SS Athletics","F",12,"2011-11-24",4101637,1,"U13G","SP",352221]
[27,"U15G_100m",13.5,"Evie","Boygle","City of Southend On Sea AC","F",13,"2010-12-16",4048984,1,"U15G","100m",352271]
[27,"U15G_200m",26.5,"Evie","Boygle","City of Southend On Sea AC","F",13,"2010-12-16",4048984,1,"U15G","200m",352271]
[27,"U15G_LJ",4.5,"Evie","Boygle","City of Southend On Sea AC","F",13,"2010-12-16",4048984,1,"U15G","LJ",352271]
[28,"U15G_200m",30,"Hanna","Edwards","Ipswich Harriers","F",13,"2011-02-02",4062694,1,"U15G","200m",352290]
[28,"U15G_300m",45,"Hanna","Edwards","Ipswich Harriers","F",13,"2011-02-02",4062694,1,"U15G","300m",352290]
[28,"U15G_LJ",4.0999999999999996,"Hanna","Edwards","Ipswich Harriers","F",13,"2011-02-02",4062694,1,"U15G","LJ",352290]
[29,"SM_1500m","00:04:20","Hamza","Zahir","Rochford Running Club","M",27,"1997-12-21",4083060,1,"SM","1500m",352356]
[30,"U7G_50m",15,"Imogen","Lon","Unattached","F",6,"2018-05-25",null,-1,"U7G","50m",352382]
[31,"U11G_600m",1.56,"Evie","Jones","Aldershot Farnham & District","F",10,"2014-04-25",4098407,0,"U11G","600m",352427]
[32,"U7G_50m",10.8,"Zara","Jones","Young Athletes Club","F",6,"2018-04-18",null,-1,"U7G","50m",352431]
[33,"U9B_60m",10.5,"Ethan","Boygle","Unattached","M",8,"2015-10-15",null,1,"U9B","60m",352503]
[33,"U9B_120m",29,"Ethan","Boygle","Unattached","M",8,"2015-10-15",null,1,"U9B","120m",352503]
[34,"U15B_1500m","00:04:56","Frankie","Edwards","Brentwood Beagles Athletics Club","M",13,"2010-09-01",3999647,1,"U15B","1500m",352574]
[35,"U15B_1500m","00:00:04.200","Matthew","Delea","Brentwood Beagles Athletics Club","M",14,"2009-09-03",4039592,1,"U15B","1500m",352741]
[36,"U20W_DT",35,"Erin","Delea","Chelmsford AC","F",17,"2007-06-28",3996929,1,"U20W","DT",352742]
[37,"U17W_300m",43.5,"Ione","Lon","Unattached","F",15,"2009-01-10",null,-1,"U17W","300m",352808]
[38,"U13G_200m",37,"Allegra","Gault-Poyntz","City of Southend On Sea AC","F",11,"2013-02-08",null,-2,"U13G","200m",352852]
[38,"U13G_LJ",2.8,"Allegra","Gault-Poyntz","City of Southend On Sea AC","F",11,"2013-02-08",null,-2,"U13G","LJ",352852]
[39,"U15G_DT",12,"Eleanor","Angeli","Brentwood Beagles Athletics Club","F",14,"2009-12-22",4107566,1,"U15G","DT",352859]
[39,"U15G_SP",6.77,"Eleanor","Angeli","Brentwood Beagles Athletics Club","F",14,"2009-12-22",4107566,1,"U15G","SP",352859]
[40,"U13B_100m",14.5,"Max","Cheetham","Brentwood Beagles Athletics Club","M",11,"2012-10-01",4148419,1,"U13B","100m",352874]
[40,"U13B_200m",29,"Max","Cheetham","Brentwood Beagles Athletics Club","M",11,"2012-10-01",4148419,1,"U13B","200m",352874]
[40,"U13B_LJ",3.8,"Max","Cheetham","Brentwood Beagles Athletics Club","M",11,"2012-10-01",4148419,1,"U13B","LJ",352874]
[41,"U13G_1500m","00:05:40","Fleur","Burrows","SS Athletics","F",11,"2012-10-06",4113308,1,"U13G","1500m",352914]
[42,"U11G_600m","00:02:10","Honor","Burrows","SS Athletics","F",9,"2014-09-08",null,1,"U11G","600m",352916]
[43,"U15G_1500m","00:00:05.200","Annalise","Burrows","City of Southend On Sea AC","F",14,"2009-09-20",4039584,1,"U15G","1500m",352920]
[44,"VW_MileWalk",10.59,"Kirsten","McTeer","Central Park Athletics","F",49,"1975-08-10",3785203,3785203,"VW","MileWalk",352921]
[45,"U13B_MileWalk",10.3,"Rowan","McTeer","Central Park Athletics","M",11,"2012-12-21",4122116,1,"U13B","MileWalk",352922]
[46,"U7B_50m","00.20.00","Arthur","O'Kill","City of Southend On Sea AC","M",6,"2017-12-24",null,1,"U7B","50m",352984]
[47,"U7G_50m","00.20.00","Scarlett","O'Kill","City of Southend On Sea AC","F",5,"2019-08-27",null,1,"U7G","50m",352986]
[48,"U11G_600m","00:01:55","Sienna","Finnegan","SS Athletics","F",10,"2013-12-21",null,-1,"U11G","600m",353039]
[49,"U11G_75m",6,"Danielle","Nti-Jackson","SS Athletics","F",10,"2014-07-08",null,-1,"U11G","75m",353053]
[49,"U11G_150m",6,"Danielle","Nti-Jackson","SS Athletics","F",10,"2014-07-08",null,-1,"U11G","150m",353053]
[49,"U11G_600m",6,"Danielle","Nti-Jackson","SS Athletics","F",10,"2014-07-08",null,-1,"U11G","600m",353053]
[50,"U9G_60m",6,"Serena","Nti-Jackson","SS Athletics","F",7,"2017-06-20",null,1,"U9G","60m",353054]
[50,"U9G_120m",6,"Serena","Nti-Jackson","SS Athletics","F",7,"2017-06-20",null,1,"U9G","120m",353054]
[50,"U9G_400m",6,"Serena","Nti-Jackson","SS Athletics","F",7,"2017-06-20",null,1,"U9G","400m",353054]
[51,"U13G_1500m","00:05:20","Sadie","Owen","SS Athletics","F",12,"2012-06-13",4049031,1,"U13G","1500m",353058]
[51,"U13G_DT",12,"Sadie","Owen","SS Athletics","F",12,"2012-06-13",4049031,1,"U13G","DT",353058]
[52,"U13B_100m",14,"Bradley","Stone","Hillingdon AC","M",12,"2012-05-10",4048062,1,"U13B","100m",353076]
[52,"U13B_LJ",4.78,"Bradley","Stone","Hillingdon AC","M",12,"2012-05-10",4048062,1,"U13B","LJ",353076]
[52,"U13B_HJ",1.52,"Bradley","Stone","Hillingdon AC","M",12,"2012-05-10",4048062,1,"U13B","HJ",353076]
[53,"U15B_LJ",4.6900000000000004,"Joseph","Fotherby","City of Southend On Sea AC","M",13,"2011-08-10",4048435,1,"U15B","LJ",351111]
[53,"U15B_300m",48.3,"Joseph","Fotherby","City of Southend On Sea AC","M",13,"2011-08-10",4048435,1,"U15B","300m",351111]
[54,"U15G_100m",14.2,"Annalise","Rushworth","Windsor Slough Eton & Hounslow AC","F",13,"2011-07-26",4036897,1,"U15G","100m",353153]
[54,"U15G_LJ",3.9,"Annalise","Rushworth","Windsor Slough Eton & Hounslow AC","F",13,"2011-07-26",4036897,1,"U15G","LJ",353153]
[54,"U15G_HJ",1.25,"Annalise","Rushworth","Windsor Slough Eton & Hounslow AC","F",13,"2011-07-26",4036897,1,"U15G","HJ",353153]
[55,"U11B_600m",1.55,"Rocco","Thompson","SS Athletics","M",9,"2014-11-26",null,-1,"U11B","600m",353172]
[56,"U13G_100m",14.57,"Poppy","Byford","City of Southend On Sea AC","F",11,"2012-09-08",4116982,1,"U13G","100m",353409]
[56,"U13G_200m",30.07,"Poppy","Byford","City of Southend On Sea AC","F",11,"2012-09-08",4116982,1,"U13G","200m",353409]
[56,"U13G_SP",6.83,"Poppy","Byford","City of Southend On Sea AC","F",11,"2012-09-08",4116982,1,"U13G","SP",353409]
[57,"U17W_300m",44.7,"Chloe","Fotherby","City of Southend On Sea AC","F",15,"2008-12-28",4005271,1,"U17W","300m",353358]
[57,"U17W_800m","00:02:27.700","Chloe","Fotherby","City of Southend On Sea AC","F",15,"2008-12-28",4005271,1,"U17W","800m",353358]
[58,"U15G_300m",45,"Amalia","Gray","City of Southend On Sea AC","F",14,"2010-02-01",4115103,1,"U15G","300m",353396]
[58,"U15G_800m","00:02:45","Amalia","Gray","City of Southend On Sea AC","F",14,"2010-02-01",4115103,1,"U15G","800m",353396]
[59,"U17W_800m","00:02:18","Naomi","Sandercock","Colchester & Tendring AC","F",15,"2008-10-14",3943227,1,"U17W","800m",353499]
[60,"VW_SP",8,"Lesley","Richardson","Enfield and Haringey A C","F",55,"1969-03-26",2661555,1,"VW","SP",353556]
[61,"U15B_HJ",1.7,"Jake","Read","Chelmsford AC","M",13,"2011-02-12",4088963,4088963,"U15B","HJ",353563]
[62,"U15G_300m",42.3,"Isla","Barker","Ipswich Harriers","F",14,"2009-09-03",4001632,1,"U15G","300m",353683]
[62,"U15G_LJ",4.92,"Isla","Barker","Ipswich Harriers","F",14,"2009-09-03",4001632,1,"U15G","LJ",353683]
[63,"U15B_100m",13.02,"George","Hill","City of Southend On Sea AC","M",13,"2010-11-12",4109125,1,"U15B","100m",353692]
[63,"U15B_200m",26.89,"George","Hill","City of Southend On Sea AC","M",13,"2010-11-12",4109125,1,"U15B","200m",353692]
[63,"U15B_300m",46.7,"George","Hill","City of Southend On Sea AC","M",13,"2010-11-12",4109125,1,"U15B","300m",353692]
[64,"U15G_100m",14,"Harriet","McCart","Ipswich Jaffa RC","F",14,"2010-03-31",4052847,1,"U15G","100m",353721]
[64,"U15G_200m",29,"Harriet","McCart","Ipswich Jaffa RC","F",14,"2010-03-31",4052847,1,"U15G","200m",353721]
[64,"U15G_300m",46,"Harriet","McCart","Ipswich Jaffa RC","F",14,"2010-03-31",4052847,1,"U15G","300m",353721]
[65,"U13B_100m",13,"Logan","Hay","SS Athletics","M",12,"2011-09-21",4070818,1,"U13B","100m",353737]
[65,"U13B_LJ",4.4000000000000004,"Logan","Hay","SS Athletics","M",12,"2011-09-21",4070818,1,"U13B","LJ",353737]
[65,"U13B_SP",8.5,"Logan","Hay","SS Athletics","M",12,"2011-09-21",4070818,1,"U13B","SP",353737]
[66,"U11G_75m",12,"Bonnie","Hay","SS Athletics","F",10,"2014-02-20",null,1,"U11G","75m",353738]
[66,"U11G_150m",25,"Bonnie","Hay","SS Athletics","F",10,"2014-02-20",null,1,"U11G","150m",353738]
[66,"U11G_LJ",2.6,"Bonnie","Hay","SS Athletics","F",10,"2014-02-20",null,1,"U11G","LJ",353738]
[67,"U13G_100m",16,"Evie","Tasneem","Basildon AC","F",12,"2012-07-30",4144082,1,"U13G","100m",353759]
[67,"U13G_LJ",3.94,"Evie","Tasneem","Basildon AC","F",12,"2012-07-30",4144082,1,"U13G","LJ",353759]
[68,"U9G_60m",4,"Ethan","Adenodi","SS Athletics","M",8,"2016-06-16",null,-2,"U9G","60m",353786]
[68,"U9G_120m",4,"Ethan","Adenodi","SS Athletics","M",8,"2016-06-16",null,-2,"U9G","120m",353786]
[69,"U9G_60m",4,"Esther","Adenodi","SS Athletics","F",8,"2016-06-16",null,1,"U9G","60m",353787]
[69,"U9G_120m",4,"Esther","Adenodi","SS Athletics","F",8,"2016-06-16",null,1,"U9G","120m",353787]
[70,"U13B_100m",4,"Caleb","Adenodi","SS Athletics","M",11,"2013-08-08",null,1,"U13B","100m",353788]
[71,"U7B_50m",10,"Harvey","Young","SS Athletics","M",5,"2019-04-03",null,1,"U7B","50m",353804]
[72,"U13G_800m","00:02:35","Amalie","Twydell","Brentwood Beagles Athletics Club","F",12,"2012-07-11",3966966,1,"U13G","800m",351337]
[73,"U15G_DT",22,"Dakota","Sladden","SS Athletics","F",14,"2010-06-11",4103731,1,"U15G","DT",353570]
[73,"U15G_800m","00:02:53","Dakota","Sladden","SS Athletics","F",14,"2010-06-11",4103731,1,"U15G","800m",353570]
[73,"U15G_HJ",1.4,"Dakota","Sladden","SS Athletics","F",14,"2010-06-11",4103731,1,"U15G","HJ",353570]
[74,"U11G_75m",13,"Esme-Ann","Canter","SS Athletics","F",9,"2014-12-19",null,1,"U11G","75m",353805]
[75,"U11G_75m",0.12,"Beatrice","Webb","SS Athletics","F",9,"2015-05-26",null,-1,"U11G","75m",353821]
[75,"U11G_LJ",3.2,"Beatrice","Webb","SS Athletics","F",9,"2015-05-26",null,-1,"U11G","LJ",353821]
[76,"U20W_SP",9,"Daniella","Oladele ","Thurrock Harriers","F",18,"2006-09-30",3835620,1,"U20W","SP",353826]
[77,"U13G_100m",15,"Davina","Oladele","Thurrock Harriers","F",11,"2013-07-21",4129218,1,"U13G","100m",353828]
[77,"U13G_LJ",2,"Davina","Oladele","Thurrock Harriers","F",11,"2013-07-21",4129218,1,"U13G","LJ",353828]
[77,"U13G_SP",6,"Davina","Oladele","Thurrock Harriers","F",11,"2013-07-21",4129218,1,"U13G","SP",353828]
[78,"U13G_100m",14.5,"Kylin","Simpson","Aldershot Farnham & District","F",12,"2012-02-12",3987922,1,"U13G","100m",349795]
[78,"U13G_200m",28,"Kylin","Simpson","Aldershot Farnham & District","F",12,"2012-02-12",3987922,1,"U13G","200m",349795]
[78,"U13G_LJ",4.3,"Kylin","Simpson","Aldershot Farnham & District","F",12,"2012-02-12",3987922,1,"U13G","LJ",349795]
[79,"U13B_100m","2014-12-01","Matthew","Cottee","Brentwood Beagles Athletics Club","M",12,"2012-06-01",4111841,1,"U13B","100m",353838]
[79,"U13B_HJ",1.29,"Matthew","Cottee","Brentwood Beagles Athletics Club","M",12,"2012-06-01",4111841,1,"U13B","HJ",353838]
[80,"U11B_75m","2013-11-01","Nathan","Cottee","Brentwood Beagles Athletics Club","M",9,"2015-08-19",null,-1,"U11B","75m",353840]
[80,"U11B_LJ",2.2000000000000002,"Nathan","Cottee","Brentwood Beagles Athletics Club","M",9,"2015-08-19",null,-1,"U11B","LJ",353840]
[81,"U11G_75m",20,"Hannah","Abdelruhman","SS Athletics","F",9,"2014-12-26",null,-1,"U11G","75m",353853]
[81,"U11G_LJ",2,"Hannah","Abdelruhman","SS Athletics","F",9,"2014-12-26",null,-1,"U11G","LJ",353853]
[82,"VW_1500m","00:05:48","Joanne","Bolter","Leigh-on-Sea Striders","F",51,"1972-09-16",3938963,1,"VW","1500m",352213]
[83,"U9G_60m",11,"Olivia","Wenn","SS Athletics","F",7,"2016-11-21",null,-1,"U9G","60m",353870]
[84,"U11B_75m",12,"James","Brazier","SS Athletics","M",9,"2014-10-15",null,-1,"U11B","75m",353872]
[84,"U11B_600m","00:02:30","James","Brazier","SS Athletics","M",9,"2014-10-15",null,-1,"U11B","600m",353872]
[84,"U11B_LJ",3.5,"James","Brazier","SS Athletics","M",9,"2014-10-15",null,-1,"U11B","LJ",353872]
[85,"SM_SP",12.3,"Khuwayne","Linton","Harrow AC","M",23,"2001-03-21",3500340,1,"SM","SP",353873]
[86,"U13B_HJ",1.45,"William","Short","SS Athletics","M",12,"2012-01-19",4154950,1,"U13B","HJ",353886]
[87,"U15B_1500m","00:04:32","Lewis","Jopling","City of Southend On Sea AC","M",14,"2009-12-31",4017787,1,"U15B","1500m",353899]
[88,"U11B_75m",13.5,"Rafael","Stammers","Unattached","M",9,"2015-01-18",null,1,"U11B","75m",353906]
[88,"U11B_600m",2.2000000000000002,"Rafael","Stammers","Unattached","M",9,"2015-01-18",null,1,"U11B","600m",353906]
[88,"U11B_LJ",3,"Rafael","Stammers","Unattached","M",9,"2015-01-18",null,1,"U11B","LJ",353906]
[89,"U11G_600m","00:01:56","Millie","Foy","SS Athletics","F",10,"2014-01-16",null,-2,"U11G","600m",353911]
[90,"U9G_400m",1.6,"Rosie","Foy","SS Athletics","F",8,"2015-10-22",null,1,"U9G","400m",353912]
[91,"U7B_50m",15,"Alfie","Richardson","SS Athletics","M",6,"2018-02-11",null,-1,"U7B","50m",353917]
[92,"U15B_HJ",1.55,"Larry","Dunn","SS Athletics","M",13,"2011-01-22",4153187,4153187,"U15B","HJ",353849]
[93,"U11B_75m",1,"Eli","Hollidge","SS Athletics","M",10,"2014-01-19",null,-1,"U11B","75m",353923]
[93,"U11B_150m",1,"Eli","Hollidge","SS Athletics","M",10,"2014-01-19",null,-1,"U11B","150m",353923]
[93,"U11B_LJ",1,"Eli","Hollidge","SS Athletics","M",10,"2014-01-19",null,-1,"U11B","LJ",353923]
[94,"U15G_DT",25.57,"Madison","Poulter","Chelmsford AC","F",14,"2010-04-18",4045804,1,"U15G","DT",349630]
[94,"U15G_200m",30.72,"Madison","Poulter","Chelmsford AC","F",14,"2010-04-18",4045804,1,"U15G","200m",349630]
[95,"U11B_600m",2.21,"Oliver","Evison","SS Athletics","M",10,"2013-09-27",null,-1,"U11B","600m",353932]
[96,"U20W_HJ",1.69,"Ena","Olivier","Herts Phoenix AC","F",18,"2006-06-26",3545848,1,"U20W","HJ",353933]
[97,"U13B_1500m","00:05:01","Harry","Wing","Basildon AC","M",12,"2012-05-20",4061056,1,"U13B","1500m",353947]
[98,"U13B_1500m","00:05:10","Oliver","Lupton","SS Athletics","M",11,"2012-11-20",4089740,4089740,"U13B","1500m",353994]
[98,"U13B_LJ",3.44,"Oliver","Lupton","SS Athletics","M",11,"2012-11-20",4089740,4089740,"U13B","LJ",353994]
[99,"U13G_100m",14.2,"Dina","Bozorgi","Watford Harriers","F",12,"2012-02-25",3999398,1,"U13G","100m",354026]
[99,"U13G_LJ",4.24,"Dina","Bozorgi","Watford Harriers","F",12,"2012-02-25",3999398,1,"U13G","LJ",354026]
[100,"U13G_200m",33,"Abigail","Scragg","Camberley & District AC","F",12,"2011-09-01",4043026,1,"U13G","200m",354036]
[100,"U13G_LJ",4.08,"Abigail","Scragg","Camberley & District AC","F",12,"2011-09-01",4043026,1,"U13G","LJ",354036]
[100,"U13G_HJ",1.45,"Abigail","Scragg","Camberley & District AC","F",12,"2011-09-01",4043026,1,"U13G","HJ",354036]
[101,"U13G_100m",15,"Ivy-Rose","Hallahan","Colchester & Tendring AC","F",11,"2013-03-08",4067131,1,"U13G","100m",354040]
[101,"U13G_1500m","00:05:44","Ivy-Rose","Hallahan","Colchester & Tendring AC","F",11,"2013-03-08",4067131,1,"U13G","1500m",354040]
[101,"U13G_HJ",1.2,"Ivy-Rose","Hallahan","Colchester & Tendring AC","F",11,"2013-03-08",4067131,1,"U13G","HJ",354040]
[102,"U9G_60m",333,"Nainsi","Hallahan","Unattached","F",7,"2017-02-11",null,-1,"U9G","60m",354042]
[102,"U9G_400m",333,"Nainsi","Hallahan","Unattached","F",7,"2017-02-11",null,-1,"U9G","400m",354042]
[103,"U11G_600m","00:02:02","Ronni","Townsend","Colchester & Tendring AC","F",9,"2014-09-17",4117838,1,"U11G","600m",354060]
[104,"U11G_150m",27,"Kirsten","Townsend","Colchester & Tendring AC","F",9,"2014-09-17",4117839,1,"U11G","150m",354061]
[104,"U11G_LJ",2.9,"Kirsten","Townsend","Colchester & Tendring AC","F",9,"2014-09-17",4117839,1,"U11G","LJ",354061]
[105,"VM_1500m","00:04:45","Jason","Townsend","Colchester & Tendring AC","M",47,"1976-10-12",4122176,1,"VM","1500m",354038]
[106,"U17M_1500m","00:04:38","Bradley","Silvain","Basildon AC","M",16,"2007-12-24",3943286,3943286,"U17M","1500m",354065]
[106,"U17M_HJ",1.6,"Bradley","Silvain","Basildon AC","M",16,"2007-12-24",3943286,3943286,"U17M","HJ",354065]
[107,"U17M_1500m","00:04:41","Hayden","Silvain","Basildon AC","M",15,"2009-06-14",4001421,1,"U17M","1500m",354066]
[108,"U11G_150m",1,"Ella","Silvain","Unattached","F",10,"2014-04-04",null,1,"U11G","150m",354068]
[108,"U11G_600m","00:04:00","Ella","Silvain","Unattached","F",10,"2014-04-04",null,1,"U11G","600m",354068]
[108,"U11G_LJ",1.2,"Ella","Silvain","Unattached","F",10,"2014-04-04",null,1,"U11G","LJ",354068]
[109,"U7B_50m",0.4,"Toby","Silvain","Unattached","M",6,"2017-12-30",null,1,"U7B","50m",354069]
[110,"U7G_50m",2,"Isabella","William","City of Southend On Sea AC","F",6,"2018-08-21",null,-1,"U7G","50m",354099]
[111,"U11G_75m",0.2,"Edith","Brook","SS Athletics","F",9,"2015-01-21",null,-1,"U11G","75m",354116]
[111,"U11G_LJ",3,"Edith","Brook","SS Athletics","F",9,"2015-01-21",null,-1,"U11G","LJ",354116]
[112,"VW_MileWalk","11.00.00","Linda","Mountford","Unattached","F",58,"1965-11-11",null,-1,"VW","MileWalk",354151]
[113,"VM_100m",13.3,"Dr John","Browne","Marshall Milton Keynes AC","M",71,"1953-07-25",null,-2,"VM","100m",354157]
[113,"VM_200m",28.5,"Dr John","Browne","Marshall Milton Keynes AC","M",71,"1953-07-25",null,-2,"VM","200m",354157]
[114,"U13B_1500m",5,"Charlie","Lee","SS Athletics","M",12,"2012-07-03",4087025,1,"U13B","1500m",354159]
[114,"U13B_LJ",4,"Charlie","Lee","SS Athletics","M",12,"2012-07-03",4087025,1,"U13B","LJ",354159]
[115,"U13B_1500m","00:04:57.500","Charlie","Smith","SS Athletics","M",12,"2012-04-12",4051234,1,"U13B","1500m",354190]
[116,"U15G_DT",24,"Izzy","Jones","SS Athletics","F",14,"2010-05-14",4094774,1,"U15G","DT",354189]
[117,"U13G_100m","00.14.80","Rose","Harris","SS Athletics","F",11,"2013-08-17",4148104,1,"U13G","100m",354191]
[118,"U13B_100m",13.2,"Finn","Petherbridge","SS Athletics","M",12,"2011-12-30",4048991,1,"U13B","100m",354199]
[118,"U13B_LJ",4.67,"Finn","Petherbridge","SS Athletics","M",12,"2011-12-30",4048991,1,"U13B","LJ",354199]
[118,"U13B_HJ",148,"Finn","Petherbridge","SS Athletics","M",12,"2011-12-30",4048991,1,"U13B","HJ",354199]
[119,"U13B_100m",12.8,"Zac","Petherbridge","SS Athletics","M",12,"2011-12-30",4048990,1,"U13B","100m",354200]
[119,"U13B_LJ",4.54,"Zac","Petherbridge","SS Athletics","M",12,"2011-12-30",4048990,1,"U13B","LJ",354200]
[119,"U13B_DT",26.42,"Zac","Petherbridge","SS Athletics","M",12,"2011-12-30",4048990,1,"U13B","DT",354200]
[120,"U13G_100m",0,"Scarlett ","Demello ","SS Athletics","F",12,"2012-04-05",4089735,1,"U13G","100m",354209]
[120,"U13G_200m",0,"Scarlett ","Demello ","SS Athletics","F",12,"2012-04-05",4089735,1,"U13G","200m",354209]
[120,"U13G_LJ",0,"Scarlett ","Demello ","SS Athletics","F",12,"2012-04-05",4089735,1,"U13G","LJ",354209]
[121,"U17W_300m",40.49,"Noa","Chodokufa","Woodford Green AC with Essex Ladies","F",15,"2009-07-05",4108151,4108151,"U17W","300m",354212]
[122,"U7B_50m",9,"Harry","Chittock","City of Southend On Sea AC","M",6,"2017-09-11",null,-1,"U7B","50m",354218]
[123,"U11B_75m",2,"Stanley","Holmes","SS Athletics","M",10,"2014-07-04",null,-1,"U11B","75m",354219]
[124,"U11B_75m",10,"Zach","McKeeganey","SS Athletics","M",9,"2015-01-29",null,-1,"U11B","75m",354221]
[124,"U11B_600m",3,"Zach","McKeeganey","SS Athletics","M",9,"2015-01-29",null,-1,"U11B","600m",354221]
[124,"U11B_LJ",2,"Zach","McKeeganey","SS Athletics","M",9,"2015-01-29",null,-1,"U11B","LJ",354221]
[125,"U17M_1500m","00:04:17","Finlay","Evison","Basildon AC","M",16,"2008-01-05",3996130,1,"U17M","1500m",354222]
[126,"U13B_100m",14.9,"Seif","Fahmy","SS Athletics","M",11,"2012-09-11",4148108,1,"U13B","100m",354224]
[126,"U13B_LJ",3.94,"Seif","Fahmy","SS Athletics","M",11,"2012-09-11",4148108,1,"U13B","LJ",354224]
[126,"U13B_DT",0,"Seif","Fahmy","SS Athletics","M",11,"2012-09-11",4148108,1,"U13B","DT",354224]
[127,"U9B_60m",7.75,"Jael","Hibbert","Brentwood Beagles Athletics Club","M",7,"2016-09-29",4134768,1,"U9B","60m",351222]
[127,"U9B_400m","1.02.00","Jael","Hibbert","Brentwood Beagles Athletics Club","M",7,"2016-09-29",4134768,1,"U9B","400m",351222]
[128,"SW_100m",13.31,"Victoria","Staines","City of Southend On Sea AC","F",27,"1997-10-14",3231009,1,"SW","100m",354249]
[128,"SW_200m",29.5,"Victoria","Staines","City of Southend On Sea AC","F",27,"1997-10-14",3231009,1,"SW","200m",354249]
[129,"VM_MileWalk",9.3000000000000007,"John","Taylor","Brentwood Beagles Athletics Club","M",69,"1954-12-03",3525113,1,"VM","MileWalk",354252]
[130,"U13G_800m","00:02:31","Hattie","Blackburn","Basildon AC","F",12,"2012-06-22",4058085,1,"U13G","800m",354258]
[131,"U11B_75m",14,"Hari","Fox","Unattached","M",9,"2015-08-20",null,1,"U11B","75m",354260]
[131,"U11B_150m",30,"Hari","Fox","Unattached","M",9,"2015-08-20",null,1,"U11B","150m",354260]
[131,"U11B_LJ",2.5,"Hari","Fox","Unattached","M",9,"2015-08-20",null,1,"U11B","LJ",354260]
[132,"U13B_200m",30,"Ketan","Fox","Unattached","M",11,"2012-09-16",null,-1,"U13B","200m",354261]
[132,"U13B_1500m","00:07:00","Ketan","Fox","Unattached","M",11,"2012-09-16",null,-1,"U13B","1500m",354261]
[132,"U13B_LJ",3,"Ketan","Fox","Unattached","M",11,"2012-09-16",null,-1,"U13B","LJ",354261]
[133,"VW_DT",20,"Jemma","Spellacy","Basildon AC","F",41,"1982-11-27",4117692,1,"VW","DT",354264]
[133,"VW_SP",8.6999999999999993,"Jemma","Spellacy","Basildon AC","F",41,"1982-11-27",4117692,1,"VW","SP",354264]
[134,"U11G_75m",13,"Elsie","Perry","SS Athletics","F",9,"2015-05-04",null,1,"U11G","75m",354266]
[134,"U11G_150m",30,"Elsie","Perry","SS Athletics","F",9,"2015-05-04",null,1,"U11G","150m",354266]
[134,"U11G_600m",2.35,"Elsie","Perry","SS Athletics","F",9,"2015-05-04",null,1,"U11G","600m",354266]
[135,"U7B_50m",11,"Amari","Hoyte","Brentwood Beagles Athletics Club","M",6,"2018-07-11",4107986,1,"U7B","50m",354269]
[136,"U13G_100m",14.1,"Dolci","Hoyte","Brentwood Beagles Athletics Club","F",12,"2012-03-25",4107985,1,"U13G","100m",354268]
[137,"U13B_100m",13.45,"Kairhys","Hoyte","Brentwood Beagles Athletics Club","M",12,"2012-03-25",4107038,1,"U13B","100m",354267]
[138,"U13G_100m",13.7,"Bella","Marshment","Herts Phoenix AC","F",12,"2012-06-14",4039193,1,"U13G","100m",354274]
[138,"U13G_200m",29.2,"Bella","Marshment","Herts Phoenix AC","F",12,"2012-06-14",4039193,1,"U13G","200m",354274]
[138,"U13G_LJ",4.2699999999999996,"Bella","Marshment","Herts Phoenix AC","F",12,"2012-06-14",4039193,1,"U13G","LJ",354274]
[139,"VW_DT",15,"Sarah","Norton","Castle Point Joggers","F",52,"1972-01-12",2732089,2732089,"VW","DT",354278]
[139,"VW_SP",7,"Sarah","Norton","Castle Point Joggers","F",52,"1972-01-12",2732089,2732089,"VW","SP",354278]
[140,"VM_1500m","00:04:50","Terence","Spooner","Castle Point Joggers","M",52,"1972-06-15",3024351,1,"VM","1500m",354312]
[141,"VM_1500m","00:07:00","Glenn","Massey","Unattached","M",56,"1968-07-26",null,-1,"VM","1500m",354325]
[142,"U9B_400m","1.28.00","Jake","Pearce","SS Athletics","M",8,"2015-09-08",null,1,"U9B","400m",354327]
[143,"U9G_400m","1.32.00","Olivia","Pearce","SS Athletics","F",8,"2015-09-08",null,1,"U9G","400m",354329]
[144,"U11B_150m",0.2,"Angelo","Massey","Unattached","M",9,"2015-04-01",null,1,"U11B","150m",354399]
[144,"U11B_600m",0.55000000000000004,"Angelo","Massey","Unattached","M",9,"2015-04-01",null,1,"U11B","600m",354399]
[144,"U11B_LJ",2.1,"Angelo","Massey","Unattached","M",9,"2015-04-01",null,1,"U11B","LJ",354399]
[145,"U15B_100m",11.6,"Finn","Bates","Colchester & Tendring AC","M",14,"2010-01-19",3727886,1,"U15B","100m",354402]
[145,"U15B_200m",23.6,"Finn","Bates","Colchester & Tendring AC","M",14,"2010-01-19",3727886,1,"U15B","200m",354402]
[146,"VM_100m",13.14,"Stuart","Carter","Brentwood Beagles Athletics Club","M",50,"1974-02-15",4085858,1,"VM","100m",354407]
[147,"U17W_DT",34,"Matilda","Hewitt","Chelmsford AC","F",15,"2008-10-29",3993559,1,"U17W","DT",354416]
[147,"U17W_SP",13.4,"Matilda","Hewitt","Chelmsford AC","F",15,"2008-10-29",3993559,1,"U17W","SP",354416]
[148,"SW_100m",14,"Amy","King","Unattached","F",32,"1992-10-20",null,-1,"SW","100m",354422]
[148,"SW_200m",27,"Amy","King","Unattached","F",32,"1992-10-20",null,-1,"SW","200m",354422]
[149,"U11G_75m",12,"Sofia","Lyttle","Colchester & Tendring AC","F",10,"2013-11-13",4068848,1,"U11G","75m",354471]
[149,"U11G_150m",26,"Sofia","Lyttle","Colchester & Tendring AC","F",10,"2013-11-13",4068848,1,"U11G","150m",354471]
[150,"U17W_300m",42.51,"Lucy","Bulman","Chelmsford AC","F",15,"2009-03-07",3946380,1,"U17W","300m",354479]
[151,"U13G_100m",14,"Lucia","Radley","SS Athletics","F",11,"2013-01-13",4135023,1,"U13G","100m",354485]
[151,"U13G_200m",32,"Lucia","Radley","SS Athletics","F",11,"2013-01-13",4135023,1,"U13G","200m",354485]
[151,"U13G_LJ",3.5,"Lucia","Radley","SS Athletics","F",11,"2013-01-13",4135023,1,"U13G","LJ",354485]
[152,"U9B_400m",75,"Teddy","Finnegan","SS Athletics","M",8,"2016-02-25",null,1,"U9B","400m",354524]
[153,"U17M_DT",34,"Oscar","Jerman","City Of Norwich AC","M",15,"2008-12-20",4047210,1,"U17M","DT",354541]
[153,"U17M_SP",11.5,"Oscar","Jerman","City Of Norwich AC","M",15,"2008-12-20",4047210,1,"U17M","SP",354541]
[154,"U13G_DT",17,"Oluwatimileyin Elizabeth","Osei","Chelmsford AC","F",12,"2012-03-15",4156148,1,"U13G","DT",354555]
[154,"U13G_SP",8.1,"Oluwatimileyin Elizabeth","Osei","Chelmsford AC","F",12,"2012-03-15",4156148,1,"U13G","SP",354555]
[155,"U15B_800m","00:02:17","Jack","Evans","Herts Phoenix AC","M",14,"2010-04-17",4149108,1,"U15B","800m",354558]
[156,"U9G_60m",8,"Frankie","Rayner","Herts Phoenix AC","F",8,"2015-10-20",null,-1,"U9G","60m",354562]
[156,"U9G_120m",17,"Frankie","Rayner","Herts Phoenix AC","F",8,"2015-10-20",null,-1,"U9G","120m",354562]
[157,"U13B_100m",13.5,"Aiden","Tricker","SS Athletics","M",12,"2012-01-13",4133583,1,"U13B","100m",354565]
[157,"U13B_HJ",1.35,"Aiden","Tricker","SS Athletics","M",12,"2012-01-13",4133583,1,"U13B","HJ",354565]
[158,"U13B_100m",16,"Jude","Lipscombe","SS Athletics","M",11,"2013-04-25",4049790,1,"U13B","100m",354567]
[158,"U13B_800m","00:02:50","Jude","Lipscombe","SS Athletics","M",11,"2013-04-25",4049790,1,"U13B","800m",354567]
[159,"U13G_800m","00:02:04","Katie","Carver","SS Athletics","F",12,"2011-09-15",4049480,1,"U13G","800m",354576]
[160,"U13B_LJ",4,"Dylan","Phillips-Frontin","SS Athletics","M",11,"2012-12-22",4142152,1,"U13B","LJ",354577]
[160,"U13B_100m",15,"Dylan","Phillips-Frontin","SS Athletics","M",11,"2012-12-22",4142152,1,"U13B","100m",354577]
[161,"U7B_50m",15,"Samuel","Birnie","Benfleet RC","M",6,"2017-11-25",null,-1,"U7B","50m",354600]
[162,"U11B_75m",20,"Jack","Birnie","Benfleet RC","M",9,"2015-03-22",4094322,1,"U11B","75m",354601]
[162,"U11B_150m",40,"Jack","Birnie","Benfleet RC","M",9,"2015-03-22",4094322,1,"U11B","150m",354601]
[162,"U11B_600m",2,"Jack","Birnie","Benfleet RC","M",9,"2015-03-22",4094322,1,"U11B","600m",354601]
[163,"U13B_100m",15,"Ryan","Birnie","SS Athletics","M",11,"2013-07-22",4094323,4094323,"U13B","100m",354602]
[163,"U13B_200m",34,"Ryan","Birnie","SS Athletics","M",11,"2013-07-22",4094323,4094323,"U13B","200m",354602]
[163,"U13B_800m","00:02:45","Ryan","Birnie","SS Athletics","M",11,"2013-07-22",4094323,4094323,"U13B","800m",354602]
[164,"U17M_100m",11.23,"Samuel","Armstrong","Thurrock Harriers","M",16,"2007-11-25",4038007,1,"U17M","100m",354608]
[165,"U15G_800m","00:02:17","Missy","Tiller","Brentwood Beagles Athletics Club","F",14,"2010-08-04",4107036,1,"U15G","800m",354610]
[166,"U11G_75m",4,"Keziah","Njogu","SS Athletics","F",9,"2015-07-19",null,-1,"U11G","75m",354611]
[166,"U11G_150m",4,"Keziah","Njogu","SS Athletics","F",9,"2015-07-19",null,-1,"U11G","150m",354611]
[167,"U9B_60m",4,"Geoffrey","Njogu","Unattached","M",7,"2017-06-07",null,-1,"U9B","60m",354614]
[167,"U9B_120m",4,"Geoffrey","Njogu","Unattached","M",7,"2017-06-07",null,-1,"U9B","120m",354614]
[168,"U11B_75m",13,"Jack","Blomfield","SS Athletics","M",9,"2014-10-23",null,1,"U11B","75m",354616]
[168,"U11B_150m",29,"Jack","Blomfield","SS Athletics","M",9,"2014-10-23",null,1,"U11B","150m",354616]
[168,"U11B_600m","00:02:00","Jack","Blomfield","SS Athletics","M",9,"2014-10-23",null,1,"U11B","600m",354616]
[169,"U15G_800m","00:02:35","Heidi","Bailey","Basildon AC","F",13,"2010-09-19",4123815,1,"U15G","800m",354618]
[170,"U15G_100m",13.5,"Lola","Turner","SS Athletics","F",13,"2011-05-21",4094775,1,"U15G","100m",354649]
[170,"U15G_LJ",4.5,"Lola","Turner","SS Athletics","F",13,"2011-05-21",4094775,1,"U15G","LJ",354649]
[171,"U11G_75m",14.14,"Hollie","Lupton","SS Athletics","F",10,"2014-08-27",null,1,"U11G","75m",353995]
[171,"U11G_600m","00:02:44","Hollie","Lupton","SS Athletics","F",10,"2014-08-27",null,1,"U11G","600m",353995]
[171,"U11G_LJ",2,"Hollie","Lupton","SS Athletics","F",10,"2014-08-27",null,1,"U11G","LJ",353995]
[172,"U11B_75m",13.27,"Joseph","Lupton","SS Athletics","M",10,"2014-08-27",null,-2,"U11B","75m",353997]
[172,"U11B_600m","00:02:15","Joseph","Lupton","SS Athletics","M",10,"2014-08-27",null,-2,"U11B","600m",353997]
[172,"U11B_LJ",2,"Joseph","Lupton","SS Athletics","M",10,"2014-08-27",null,-2,"U11B","LJ",353997]
[173,"U15G_SP",6.5,"Keira","Marshment","Unattached","F",14,"2010-05-10",null,-1,"U15G","SP",354668]
[174,"U9B_60m",30,"Krish Leo Jay","Patel","Brentwood Beagles Athletics Club","M",7,"2017-06-15",null,-1,"U9B","60m",354672]
[174,"U9B_120m",60,"Krish Leo Jay","Patel","Brentwood Beagles Athletics Club","M",7,"2017-06-15",null,-1,"U9B","120m",354672]
[175,"U13G_1500m","00:05:26","Aria","Sabado","Brentwood Beagles Athletics Club","F",12,"2012-03-18",4110554,1,"U13G","1500m",352153]
[176,"U17M_1500m","00:04:20","Thomas","Carter","Chelmsford AC","M",15,"2009-04-15",4015117,1,"U17M","1500m",354703]
[177,"U11B_150m",25,"Jax","Connor","Woodford Green AC with Essex Ladies","M",10,"2014-06-15",null,-1,"U11B","150m",354728]
[177,"U11B_600m",1.58,"Jax","Connor","Woodford Green AC with Essex Ladies","M",10,"2014-06-15",null,-1,"U11B","600m",354728]
[178,"U11B_75m",10,"Milo","Schofield","SS Athletics","M",10,"2014-06-09",null,-1,"U11B","75m",354223]
[178,"U11B_150m",20,"Milo","Schofield","SS Athletics","M",10,"2014-06-09",null,-1,"U11B","150m",354223]
[179,"VM_MileWalk",0.11,"Steve","Allen","Ilford AC","M",66,"1958-01-22",2695588,1,"VM","MileWalk",354793]
[180,"SW_100m",13.4,"Alyssa","Dixon","Army Athletics Association","F",20,"2004-01-21",null,-2,"SW","100m",354837]
[180,"SW_200m",26,"Alyssa","Dixon","Army Athletics Association","F",20,"2004-01-21",null,-2,"SW","200m",354837]
[181,"U13G_200m",29.3,"Zenobia","Williams","Havering AC","F",12,"2012-08-29",4102484,1,"U13G","200m",354832]
[181,"U13G_DT",19,"Zenobia","Williams","Havering AC","F",12,"2012-08-29",4102484,1,"U13G","DT",354832]
[182,"U15B_1500m","00:05:30","Thomas","Anderson","Herts Phoenix AC","M",14,"2010-07-12",4154690,1,"U15B","1500m",354859]
[183,"U17M_DT",26,"Zak","Williams","Havering AC","M",15,"2008-09-12",3861264,1,"U17M","DT",354869]
[184,"U15B_800m","00:02:19","Max","Langshaw","Basildon AC","M",14,"2009-10-19",4131878,1,"U15B","800m",354906]
[185,"U9G_60m",10,"Everly","Dixon","SS Athletics","F",8,"2015-09-10",null,1,"U9G","60m",354879]
[186,"VM_800m","00:03:45.100","Alastair","Kendrick","Castle Point Joggers","M",71,"1952-11-27",2764502,1,"VM","800m",351101]
[186,"VM_1500m","00:07:00","Alastair","Kendrick","Castle Point Joggers","M",71,"1952-11-27",2764502,1,"VM","1500m",351101]
[187,"U7B_50m",13.5,"Conor","Harvey","City of Southend On Sea AC","M",5,"2018-10-31",null,-1,"U7B","50m",354987]
[188,"VM_MileWalk",13,"David","Ainsworth","Ilford AC","M",76,"1948-08-22",2983382,0,"VM","MileWalk",355015]
[189,"U15G_800m","00:02:40","Darcey","Wallis","Basildon AC","F",13,"2011-06-15",4118678,1,"U15G","800m",355031]
[190,"U15G_800m","00:02:28","Sophie","Rogers","Colchester Harriers AC","F",14,"2010-08-19",4122882,1,"U15G","800m",355033]
[191,"U15G_100m",14.6,"Cherri","Moss","Chelmsford AC","F",13,"2010-12-07",4085298,1,"U15G","100m",355035]
[191,"U15G_200m",30.8,"Cherri","Moss","Chelmsford AC","F",13,"2010-12-07",4085298,1,"U15G","200m",355035]
[191,"U15G_LJ",3.91,"Cherri","Moss","Chelmsford AC","F",13,"2010-12-07",4085298,1,"U15G","LJ",355035]
[192,"U13G_DT",14.19,"Maddie","Moss","Chelmsford AC","F",12,"2012-07-09",4143596,1,"U13G","DT",355036]
[192,"U13G_SP",5.85,"Maddie","Moss","Chelmsford AC","F",12,"2012-07-09",4143596,1,"U13G","SP",355036]
[193,"U11B_150m",0.26,"Carter","Broad","Benfleet RC","M",10,"2014-08-01",4139665,1,"U11B","150m",355047]
[193,"U11B_600m","00:02:12","Carter","Broad","Benfleet RC","M",10,"2014-08-01",4139665,1,"U11B","600m",355047]
[193,"U11B_LJ",3.1,"Carter","Broad","Benfleet RC","M",10,"2014-08-01",4139665,1,"U11B","LJ",355047]
[194,"U9G_400m",1.28,"Lois","Cassidy-George","SS Athletics","F",8,"2016-07-12",4156390,1,"U9G","400m",355057]
[195,"U15B_800m","00:02:21","Harry","Murphy","City of Southend On Sea AC","M",13,"2010-11-12",null,-2,"U15B","800m",355067]
[196,"U15G_HJ",1.58,"Emily","Archer","City of Southend On Sea AC","F",14,"2009-10-22",4064791,1,"U15G","HJ",355070]
[197,"SM_LJ",6,"James","Casey","Unattached","M",21,"2003-10-10",null,-1,"SM","LJ",355086]
[198,"U15G_DT",16.7,"Katie","Hawkins","Brentwood Beagles Athletics Club","F",14,"2009-10-05",3878772,1,"U15G","DT",355098]
[198,"U15G_SP",7.74,"Katie","Hawkins","Brentwood Beagles Athletics Club","F",14,"2009-10-05",3878772,1,"U15G","SP",355098]
[198,"U15G_MileWalk",7,"Katie","Hawkins","Brentwood Beagles Athletics Club","F",14,"2009-10-05",3878772,1,"U15G","MileWalk",355098]
[199,"U9G_60m",1,"Vivienne","Clark-Abdullah","City of Southend-on-Sea Athletic Club","F",7,"2017-04-02",null,1,"U9G","60m",355105]
[199,"U9G_120m",1,"Vivienne","Clark-Abdullah","City of Southend-on-Sea Athletic Club","F",7,"2017-04-02",null,1,"U9G","120m",355105]
[199,"U9G_400m",1,"Vivienne","Clark-Abdullah","City of Southend-on-Sea Athletic Club","F",7,"2017-04-02",null,1,"U9G","400m",355105]
[200,"U7G_50m",1,"Ophelia","Clark-Abdullah","City of Southend-on-Sea Athletic Club","F",5,"2018-12-17",null,1,"U7G","50m",355106]
[201,"U20M_SP",5,"Kobie","Dunn","SS Athletics","M",19,"2005-01-18",4126232,1,"U20M","SP",354654]
[202,"U15G_100m",14,"Alba","Newton","City of Southend On Sea AC","F",13,"2010-11-30",4121983,1,"U15G","100m",355121]
[202,"U15G_DT",20,"Alba","Newton","City of Southend On Sea AC","F",13,"2010-11-30",4121983,1,"U15G","DT",355121]
[203,"U17W_300m",55,"Hannah","Jewell","Herts Phoenix AC","F",15,"2009-03-30",3765319,1,"U17W","300m",354474]
[203,"U17W_LJ",3.8,"Hannah","Jewell","Herts Phoenix AC","F",15,"2009-03-30",3765319,1,"U17W","LJ",354474]
[203,"U17W_DT",13,"Hannah","Jewell","Herts Phoenix AC","F",15,"2009-03-30",3765319,1,"U17W","DT",354474]
[204,"U15G_800m","00:02:40","Daisy","Middlemiss","Unattached","F",14,"2010-06-28",4107128,1,"U15G","800m",355175]
[205,"U11B_75m",0.12,"Jude","Webb","SS Athletics","M",10,"2014-02-27",null,1,"U11B","75m",355176]
[205,"U11B_LJ",3.2,"Jude","Webb","SS Athletics","M",10,"2014-02-27",null,1,"U11B","LJ",355176]
[206,"U9B_60m",9,"Theo","Glenn-James","City of Southend-on-Sea Athletic Club","M",8,"2015-12-31",null,-1,"U9B","60m",355178]
[207,"U15G_200m",30.9,"Freya ","McGowan","Watford Harriers","F",13,"2010-09-29",4102127,4102127,"U15G","200m",355192]
[207,"U15G_LJ",4.25,"Freya ","McGowan","Watford Harriers","F",13,"2010-09-29",4102127,4102127,"U15G","LJ",355192]
[207,"U15G_HJ",1.6,"Freya ","McGowan","Watford Harriers","F",13,"2010-09-29",4102127,4102127,"U15G","HJ",355192]
[208,"U15B_1500m","00:04:18.100","Jude","Hearn","Brentwood Beagles Athletics Club","M",14,"2010-01-01",3987779,1,"U15B","1500m",353697]
[209,"VM_100m",13,"Bernard","William","JBR Run and Tri Club","M",35,"1989-03-17",3998728,0,"VM","100m",354890]
[209,"VM_200m",30,"Bernard","William","JBR Run and Tri Club","M",35,"1989-03-17",3998728,0,"VM","200m",354890]
[209,"VM_400m",59,"Bernard","William","JBR Run and Tri Club","M",35,"1989-03-17",3998728,0,"VM","400m",354890]
[209,"VM_800m","00:02:10","Bernard","William","JBR Run and Tri Club","M",35,"1989-03-17",3998728,0,"VM","800m",354890]
[210,"VM_LJ",4.5,"Richard","Maskell","City of Southend-on-Sea Athletic Club","M",48,"1976-05-29",3203278,0,"VM","LJ",355207]
[210,"VM_HJ",1.4,"Richard","Maskell","City of Southend-on-Sea Athletic Club","M",48,"1976-05-29",3203278,0,"VM","HJ",355207]
[210,"VM_MileWalk",13.4,"Richard","Maskell","City of Southend-on-Sea Athletic Club","M",48,"1976-05-29",3203278,0,"VM","MileWalk",355207]
[211,"U17W_DT",23.9,"Freya","Maskell","City of Southend On Sea AC","F",15,"2009-04-19",3993880,1,"U17W","DT",355209]
[212,"U11B_75m",5,"Malachi","Sibanda","SS Athletics","M",10,"2014-08-09",null,-1,"U11B","75m",355213]
[212,"U11B_150m",5,"Malachi","Sibanda","SS Athletics","M",10,"2014-08-09",null,-1,"U11B","150m",355213]
[212,"U11B_600m",5,"Malachi","Sibanda","SS Athletics","M",10,"2014-08-09",null,-1,"U11B","600m",355213]
[213,"U11B_600m","00:01:55","Patrick","Connor","Brentwood Beagles Athletics Club","M",10,"2014-08-08",null,-1,"U11B","600m",355219]
[214,"U9B_400m",1.3,"Sean","Connor","Brentwood Beagles Athletics Club","M",7,"2017-04-22",null,-1,"U9B","400m",355221]
[215,"U15G_100m",14,"Nicole","Hawkins","Brentwood Beagles Athletics Club","F",14,"2009-10-05",3878770,1,"U15G","100m",355235]
[215,"U15G_200m",27.02,"Nicole","Hawkins","Brentwood Beagles Athletics Club","F",14,"2009-10-05",3878770,1,"U15G","200m",355235]
[215,"U15G_300m",42.34,"Nicole","Hawkins","Brentwood Beagles Athletics Club","F",14,"2009-10-05",3878770,1,"U15G","300m",355235]
[216,"U13G_DT",19,"Jessica","Arnold","Brentwood Beagles Athletics Club","F",12,"2011-12-22",4149577,1,"U13G","DT",355258]
[216,"U13G_SP",7.15,"Jessica","Arnold","Brentwood Beagles Athletics Club","F",12,"2011-12-22",4149577,1,"U13G","SP",355258]
[217,"U13G_HJ",1.3,"Lucy","Richards","Watford Harriers","F",12,"2011-09-30",3830422,1,"U13G","HJ",355264]
[218,"U13B_800m","00:02:27","Dexter","Haynes","SS Athletics","M",12,"2011-12-26",4127584,1,"U13B","800m",355269]
[219,"U13B_800m","00:02:50","Aaron","Baker Durchslag","SS Athletics","M",11,"2013-04-26",4154953,1,"U13B","800m",355273]
[219,"U13B_LJ",3.5,"Aaron","Baker Durchslag","SS Athletics","M",11,"2013-04-26",4154953,1,"U13B","LJ",355273]
[220,"U11G_75m",15,"Poppy","Grimes","SS Athletics","F",9,"2015-07-14",null,-2,"U11G","75m",355278]
[220,"U11G_150m",33,"Poppy","Grimes","SS Athletics","F",9,"2015-07-14",null,-2,"U11G","150m",355278]
[220,"U11G_600m",2.35,"Poppy","Grimes","SS Athletics","F",9,"2015-07-14",null,-2,"U11G","600m",355278]
[221,"U9G_60m",20,"Penelope","Grimes","SS Athletics","F",7,"2017-03-10",null,-1,"U9G","60m",355280]
[221,"U9G_120m",40,"Penelope","Grimes","SS Athletics","F",7,"2017-03-10",null,-1,"U9G","120m",355280]
[221,"U9G_400m",1.5,"Penelope","Grimes","SS Athletics","F",7,"2017-03-10",null,-1,"U9G","400m",355280]
[222,"U15G_100m",13.31,"Pixie","Oakley","City of Southend On Sea AC","F",13,"2010-10-19",4048986,1,"U15G","100m",354882]
[223,"U11G_75m",0.75,"Isla","Emery","Benfleet RC","F",9,"2014-09-29",4059487,0,"U11G","75m",355292]
[223,"U11G_150m",1.3,"Isla","Emery","Benfleet RC","F",9,"2014-09-29",4059487,0,"U11G","150m",355292]
[224,"U9G_60m",0.75,"Eden","Emery","Unattached","F",7,"2017-04-29",null,-1,"U9G","60m",355294]
[224,"U9G_120m",1.1499999999999999,"Eden","Emery","Unattached","F",7,"2017-04-29",null,-1,"U9G","120m",355294]
[225,"U20M_400m",50,"Joshua","Robinson","City of Southend On Sea AC","M",18,"2006-11-04",3986096,1,"U20M","400m",355309]
[225,"U20M_800m","00:01:50","Joshua","Robinson","City of Southend On Sea AC","M",18,"2006-11-04",3986096,1,"U20M","800m",355309]
[226,"U11B_150m",0.1,"Oliver","Jones","Unattached","M",10,"2014-07-11",null,-1,"U11B","150m",355313]
[226,"U11B_600m",0.1,"Oliver","Jones","Unattached","M",10,"2014-07-11",null,-1,"U11B","600m",355313]
[226,"U11B_LJ",0.1,"Oliver","Jones","Unattached","M",10,"2014-07-11",null,-1,"U11B","LJ",355313]
[227,"U15B_800m","00:02:29","Tom","Ulyatt","Loughton AC","M",14,"2010-04-27",null,-2,"U15B","800m",355326]
[228,"U7B_50m",12,"Tyson","Fraser-Johnson","City of Southend-on-Sea Athletic Club","M",6,"2018-03-13",null,-1,"U7B","50m",355341]
[229,"U13G_100m",13.62,"Scarlett","Taylor","Aldershot Farnham & District","F",12,"2011-09-30",4002015,1,"U13G","100m",355363]
[229,"U13G_200m",27.19,"Scarlett","Taylor","Aldershot Farnham & District","F",12,"2011-09-30",4002015,1,"U13G","200m",355363]
[229,"U13G_LJ",4.54,"Scarlett","Taylor","Aldershot Farnham & District","F",12,"2011-09-30",4002015,1,"U13G","LJ",355363]
[230,"U15G_HJ",1.5,"Lily","Hartman","Basildon AC","F",14,"2009-11-27",3766490,1,"U15G","HJ",355011]
[230,"U15G_SP",9.0500000000000007,"Lily","Hartman","Basildon AC","F",14,"2009-11-27",3766490,1,"U15G","SP",355011]
[230,"U15G_200m",25.3,"Lily","Hartman","Basildon AC","F",14,"2009-11-27",3766490,1,"U15G","200m",355011]
[231,"SW_100m",14.5,"Laura","Hopper","London City Runners","F",23,"2001-10-20",3458863,3458863,"SW","100m",355408]
[231,"SW_200m",31.5,"Laura","Hopper","London City Runners","F",23,"2001-10-20",3458863,3458863,"SW","200m",355408]
[231,"SW_400m",75,"Laura","Hopper","London City Runners","F",23,"2001-10-20",3458863,3458863,"SW","400m",355408]
[231,"SW_800m","00:02:52","Laura","Hopper","London City Runners","F",23,"2001-10-20",3458863,3458863,"SW","800m",355408]
[231,"SW_1500m","00:05:59","Laura","Hopper","London City Runners","F",23,"2001-10-20",3458863,3458863,"SW","1500m",355408]
[232,"U11B_75m",18,"Raymond","Davis","SS Athletics","M",10,"2014-05-07",null,-1,"U11B","75m",355419]
[233,"U17W_DT",13,"Dasia","Oladele","Thurrock Harriers","F",15,"2009-08-19",3932919,1,"U17W","DT",353827]
[233,"U17W_SP",8,"Dasia","Oladele","Thurrock Harriers","F",15,"2009-08-19",3932919,1,"U17W","SP",353827]
[233,"U17W_300m",51,"Dasia","Oladele","Thurrock Harriers","F",15,"2009-08-19",3932919,1,"U17W","300m",353827]
[234,"U15G_300m",44,"Ava","Carter","Brentwood Beagles Athletics Club","F",14,"2009-12-25",4047201,1,"U15G","300m",355461]
[235,"U13G_200m",30,"Scarlett","Finlay","Watford Harriers","F",11,"2012-11-19",3934337,1,"U13G","200m",355475]
[235,"U13G_800m","00:02:37","Scarlett","Finlay","Watford Harriers","F",11,"2012-11-19",3934337,1,"U13G","800m",355475]
[236,"U11G_600m","00:02:15","Juno","Neary","SS Athletics","F",10,"2014-08-16",null,-1,"U11G","600m",355484]
[237,"U9B_60m",20,"Woody","Neary","SS Athletics","M",7,"2017-05-22",null,1,"U9B","60m",355486]
[238,"U15B_200m",25,"Luca","Patrick","Brentwood Beagles Athletics Club","M",14,"2009-12-02",4149580,1,"U15B","200m",355493]
[238,"U15B_300m",37,"Luca","Patrick","Brentwood Beagles Athletics Club","M",14,"2009-12-02",4149580,1,"U15B","300m",355493]
[238,"U15B_LJ",5.5,"Luca","Patrick","Brentwood Beagles Athletics Club","M",14,"2009-12-02",4149580,1,"U15B","LJ",355493]
[239,"U17M_1500m","00:04:22","Joshua","Eida","Chelmsford AC","M",15,"2009-03-19",3986281,1,"U17M","1500m",355018]
[240,"U15G_1500m","00:05:00","Izzy","Eida","Chelmsford AC","F",13,"2010-10-15",4014337,1,"U15G","1500m",355508]
[241,"U9G_400m",1.35,"Ella","Fenn","SS Athletics","F",7,"2016-12-06",null,-1,"U9G","400m",355506]
[242,"U9G_60m",8,"Muhammad ","Khan","City of Southend On Sea AC","M",8,"2016-05-24",null,-2,"U9G","60m",355578]
[242,"U9G_120m",8,"Muhammad ","Khan","City of Southend On Sea AC","M",8,"2016-05-24",null,-2,"U9G","120m",355578]
[242,"U9G_400m",8,"Muhammad ","Khan","City of Southend On Sea AC","M",8,"2016-05-24",null,-2,"U9G","400m",355578]
[243,"U11G_75m",11,"Ella-Rose","Garwood","SS Athletics","F",9,"2015-04-03",null,-1,"U11G","75m",355594]
[243,"U11G_600m",2.4,"Ella-Rose","Garwood","SS Athletics","F",9,"2015-04-03",null,-1,"U11G","600m",355594]
[244,"SM_1500m","00:04:00","Kieran","O'Hara","Havering AC","M",25,"1999-04-28",3372705,1,"SM","1500m",355597]
[245,"U9B_60m",15,"Robbie","Nedkov","Unattached","M",7,"2017-04-20",null,1,"U9B","60m",355598]
[245,"U9B_120m",40,"Robbie","Nedkov","Unattached","M",7,"2017-04-20",null,1,"U9B","120m",355598]
[246,"U15G_DT",35,"Monica","Malagala","Chelmsford AC","F",14,"2010-08-22",4071150,1,"U15G","DT",353940]
[246,"U15G_SP",1385,"Monica","Malagala","Chelmsford AC","F",14,"2010-08-22",4071150,1,"U15G","SP",353940]
[247,"U15B_100m",13.3,"Alfie","Kelly","Ipswich Jaffa RC","M",13,"2010-12-10",4030804,1,"U15B","100m",355645]
[247,"U15B_800m","00:02:10","Alfie","Kelly","Ipswich Jaffa RC","M",13,"2010-12-10",4030804,1,"U15B","800m",355645]
[248,"U13B_100m","0.15.0","Noah","Rumsby","SS Athletics","M",11,"2013-08-29",null,1,"U13B","100m",355667]
[248,"U13B_LJ",3.29,"Noah","Rumsby","SS Athletics","M",11,"2013-08-29",null,1,"U13B","LJ",355667]
[248,"U13B_HJ",1.05,"Noah","Rumsby","SS Athletics","M",11,"2013-08-29",null,1,"U13B","HJ",355667]
[249,"U13G_100m",14.8,"Bria","Boamah","Herts Phoenix AC","F",12,"2011-12-10",4053519,1,"U13G","100m",355743]
[249,"U13G_LJ",4.0999999999999996,"Bria","Boamah","Herts Phoenix AC","F",12,"2011-12-10",4053519,1,"U13G","LJ",355743]
[250,"U15B_300m",42,"Jack","Weston","Basildon AC","M",14,"2009-10-17",4094186,1,"U15B","300m",355757]
[250,"U15B_DT",25,"Jack","Weston","Basildon AC","M",14,"2009-10-17",4094186,1,"U15B","DT",355757]
[250,"U15B_SP",9.3000000000000007,"Jack","Weston","Basildon AC","M",14,"2009-10-17",4094186,1,"U15B","SP",355757]
[251,"U15B_300m","0.53.00","Matthew","Jones","Brentwood Beagles Athletics Club","M",14,"2010-06-24",4118311,1,"U15B","300m",355766]
[251,"U15B_800m","00:02:45","Matthew","Jones","Brentwood Beagles Athletics Club","M",14,"2010-06-24",4118311,1,"U15B","800m",355766]
[252,"U11B_75m","00.12.00","Oliver","Jones","Brentwood Beagles Athletics Club","M",10,"2013-09-06",null,-1,"U11B","75m",355771]
[252,"U11B_150m","00.30.00","Oliver","Jones","Brentwood Beagles Athletics Club","M",10,"2013-09-06",null,-1,"U11B","150m",355771]
[253,"U13G_800m","00:04:00","Sofia","Motin","City of Southend On Sea AC","F",11,"2012-12-22",4133788,1,"U13G","800m",355806]
[253,"U13G_LJ","2.60.0","Sofia","Motin","City of Southend On Sea AC","F",11,"2012-12-22",4133788,1,"U13G","LJ",355806]
[253,"U13G_DT","2.00.0","Sofia","Motin","City of Southend On Sea AC","F",11,"2012-12-22",4133788,1,"U13G","DT",355806]
[254,"U11G_600m",2.2999999999999998,"Lily","Bredin","Castle Point Joggers","F",9,"2015-04-06",4138636,1,"U11G","600m",355809]
[255,"U11G_75m","0.20.15","Rosie","Nedkov","SS Athletics","F",10,"2013-10-21",null,-2,"U11G","75m",355867]
[256,"U17M_100m",12.27,"Thomas","Jaimon","SS Athletics","M",15,"2009-06-16",4148107,1,"U17M","100m",355863]
[256,"U17M_200m",25.82,"Thomas","Jaimon","SS Athletics","M",15,"2009-06-16",4148107,1,"U17M","200m",355863]
[257,"U11B_150m",30,"Lenny","Radley","Unattached","M",9,"2015-05-29",null,-1,"U11B","150m",355887]
[257,"U11B_600m",2.1,"Lenny","Radley","Unattached","M",9,"2015-05-29",null,-1,"U11B","600m",355887]
[258,"U9B_400m",4,"George","Cain","City of Southend On Sea AC","M",8,"2015-11-28",null,-1,"U9B","400m",355941]
[258,"U9B_120m",5,"George","Cain","City of Southend On Sea AC","M",8,"2015-11-28",null,-1,"U9B","120m",355941]
[259,"U7B_50m","00.20.00","Adithan","Murali","City of Southend On Sea AC","M",6,"2018-02-17",null,-1,"U7B","50m",354933]
[260,"U15B_1500m","00:04:45","Jack","Wright","Herts Phoenix AC","M",13,"2011-05-22",4010355,1,"U15B","1500m",356015]
[261,"U15B_1500m","00:04:40","Lewis","Wright","Herts Phoenix AC","M",13,"2011-05-22",4010356,1,"U15B","1500m",356018]
[262,"U13G_100m",16,"Aiyana","Chikandwa","Unattached","F",11,"2012-09-25",null,-1,"U13G","100m",354487]
[263,"U15B_100m",13.14,"George","Thompson","City of Southend On Sea AC","M",13,"2011-04-16",4046911,1,"U15B","100m",356043]
[263,"U15B_200m",26.7,"George","Thompson","City of Southend On Sea AC","M",13,"2011-04-16",4046911,1,"U15B","200m",356043]
[264,"VW_1500m","00:05:00","Sarah","Griffith","City of Southend On Sea AC","F",37,"1986-09-26",2782904,1,"VW","1500m",356046]
[265,"U11G_75m",14,"Jessica","Hatt","SS Athletics","F",9,"2015-03-28",null,1,"U11G","75m",356067]
[265,"U11G_150m",28,"Jessica","Hatt","SS Athletics","F",9,"2015-03-28",null,1,"U11G","150m",356067]
[265,"U11G_LJ",2.7,"Jessica","Hatt","SS Athletics","F",9,"2015-03-28",null,1,"U11G","LJ",356067]
[266,"U13G_100m","00.00.22","Ciara","Tubman","City of Southend On Sea AC","F",11,"2013-08-10",4133124,1,"U13G","100m",356086]
[266,"U13G_LJ","3.78.00","Ciara","Tubman","City of Southend On Sea AC","F",11,"2013-08-10",4133124,1,"U13G","LJ",356086]
[266,"U13G_HJ","1.15.00","Ciara","Tubman","City of Southend On Sea AC","F",11,"2013-08-10",4133124,1,"U13G","HJ",356086]
[267,"U9B_60m","00.00.20","Tristan","Tubman","City of Southend On Sea AC","M",8,"2015-10-12",null,-1,"U9B","60m",356097]
[267,"U9B_400m","00.01.30","Tristan","Tubman","City of Southend On Sea AC","M",8,"2015-10-12",null,-1,"U9B","400m",356097]
[268,"U13G_200m",32,"Orla","Martin","Chelmsford AC","F",12,"2012-06-11",4099053,1,"U13G","200m",351032]
[268,"U13G_800m","00:02:30","Orla","Martin","Chelmsford AC","F",12,"2012-06-11",4099053,1,"U13G","800m",351032]
[269,"U13B_100m","0.14.00","Ethan","Frisby-Bright","Haverhill Running Club","M",11,"2013-02-23",4026483,1,"U13B","100m",356138]
[269,"U13B_200m","0.34.00","Ethan","Frisby-Bright","Haverhill Running Club","M",11,"2013-02-23",4026483,1,"U13B","200m",356138]
[269,"U13B_1500m","00:05:40","Ethan","Frisby-Bright","Haverhill Running Club","M",11,"2013-02-23",4026483,1,"U13B","1500m",356138]
[270,"U15G_1500m","00:05:20","Orla","Bowd","Unattached","F",13,"2010-10-27",null,-1,"U15G","1500m",356169]
[271,"U15G_DT",17,"Isla","Barron","Woodford Green AC with Essex Ladies","F",13,"2010-12-29",4038397,1,"U15G","DT",356181]
[272,"U11G_600m",2.1,"Rosie","Barron","Woodford Green AC with Essex Ladies","F",10,"2013-10-11",null,1,"U11G","600m",356183]
[273,"VW_1500m","00:05:00","Rebecca","O'Kill","City of Southend-on-Sea Athletic Club","F",39,"1985-08-11",3330939,3330939,"VW","1500m",352981]
[274,"U7G_50m",0.9,"Ayana","Mathe","Unattached","F",6,"2018-07-28",null,-1,"U7G","50m",356222]
[275,"U15G_1500m","00:05:25","Ella","Licence","Colchester Harriers AC","F",14,"2009-11-26",3947453,3947453,"U15G","1500m",356223]
[276,"U13G_100m",13.9,"Lacey","Martell-Smith","Colchester Harriers AC","F",11,"2012-09-03",4085871,1,"U13G","100m",356228]
[276,"U13G_200m",29,"Lacey","Martell-Smith","Colchester Harriers AC","F",11,"2012-09-03",4085871,1,"U13G","200m",356228]
[276,"U13G_LJ",3.6,"Lacey","Martell-Smith","Colchester Harriers AC","F",11,"2012-09-03",4085871,1,"U13G","LJ",356228]
[277,"U9B_60m",9,"George","Care","SS Athletics","M",8,"2016-02-14",null,-1,"U9B","60m",356232]
[277,"U9B_400m",80,"George","Care","SS Athletics","M",8,"2016-02-14",null,-1,"U9B","400m",356232]
[278,"U7G_50m",12,"Poppy","Care","SS Athletics","F",6,"2018-05-04",null,1,"U7G","50m",356233]
[279,"SM_DT",15,"Jake","Young","SS Athletics","M",34,"1990-10-06",4111400,1,"SM","DT",353800]
[279,"SM_SP",5,"Jake","Young","SS Athletics","M",34,"1990-10-06",4111400,1,"SM","SP",353800]
[279,"SM_LJ",3,"Jake","Young","SS Athletics","M",34,"1990-10-06",4111400,1,"SM","LJ",353800]
[280,"U11B_75m",12,"Dylan","Lawton Lloyd","SS Athletics","M",9,"2014-09-24",null,-1,"U11B","75m",356254]
[281,"U11B_75m",11.6,"Aarav","Kishore","SS Athletics","M",9,"2014-09-15",null,-1,"U11B","75m",353934]
[281,"U11B_150m",24,"Aarav","Kishore","SS Athletics","M",9,"2014-09-15",null,-1,"U11B","150m",353934]
[282,"SM_DT",37,"Aaron","York","Basildon AC","M",28,"1996-11-21",3011739,1,"SM","DT",356268]
[282,"SM_SP",10.5,"Aaron","York","Basildon AC","M",28,"1996-11-21",3011739,1,"SM","SP",356268]
[283,"U13G_100m",14.6,"Zara","Freese","SS Athletics","F",11,"2012-10-11",4113309,1,"U13G","100m",356272]
[283,"U13G_200m",31,"Zara","Freese","SS Athletics","F",11,"2012-10-11",4113309,1,"U13G","200m",356272]
[284,"SM_800m","00:02:00","Ellis","Swindell","Benfleet RC","M",23,"2001-11-12",3448712,1,"SM","800m",356274]
[284,"SM_1500m","00:04:05","Ellis","Swindell","Benfleet RC","M",23,"2001-11-12",3448712,1,"SM","1500m",356274]
[285,"U17W_1500m","00:06:30","Tilly","Heaton","Castle Point Joggers","F",15,"2009-05-04",4094174,1,"U17W","1500m",356280]
[285,"U17W_MileWalk",20,"Tilly","Heaton","Castle Point Joggers","F",15,"2009-05-04",4094174,1,"U17W","MileWalk",356280]
[286,"U13B_800m","00:04:00","Alex","Heaton","Castle Point Joggers","M",11,"2013-06-01",4138640,1,"U13B","800m",356283]
[286,"U13B_LJ",2,"Alex","Heaton","Castle Point Joggers","M",11,"2013-06-01",4138640,1,"U13B","LJ",356283]
[287,"SM_DT",38,"Billy","Praim-Singh","City of Southend On Sea AC","M",25,"1999-06-16",3084675,1,"SM","DT",356289]
[287,"SM_SP",13,"Billy","Praim-Singh","City of Southend On Sea AC","M",25,"1999-06-16",3084675,1,"SM","SP",356289]
[288,"U17M_400m",50,"Aydan","Holland","Basildon AC","M",15,"2009-03-03",4043525,1,"U17M","400m",356291]
[289,"U20W_400m",72,"Imogen","Jones","Basildon AC","F",17,"2007-05-08",3739922,1,"U20W","400m",356310]
[290,"U17W_300m",44.6,"Jessica","Walker","City of Southend On Sea AC","F",15,"2008-10-29",3853239,1,"U17W","300m",356311]
[290,"U17W_800m","00:02:18","Jessica","Walker","City of Southend On Sea AC","F",15,"2008-10-29",3853239,1,"U17W","800m",356311]
[290,"U17W_1500m","00:04:39.600","Jessica","Walker","City of Southend On Sea AC","F",15,"2008-10-29",3853239,1,"U17W","1500m",356311]
[291,"U13B_1500m",1111,"George","Smith","Brentwood Beagles Athletics Club","M",11,"2012-11-30",null,-2,"U13B","1500m",356315]
[291,"U13B_LJ",1111,"George","Smith","Brentwood Beagles Athletics Club","M",11,"2012-11-30",null,-2,"U13B","LJ",356315]
[292,"U11B_75m",1111,"Alex","Smith","Brentwood Beagles Athletics Club","M",9,"2014-09-14",null,1,"U11B","75m",356316]
[292,"U11B_LJ",1111,"Alex","Smith","Brentwood Beagles Athletics Club","M",9,"2014-09-14",null,1,"U11B","LJ",356316]
[293,"U15G_200m",28.9,"Martha","May","Braintree & District AC","F",14,"2010-07-01",3863293,1,"U15G","200m",356323]
[293,"U15G_300m",44.9,"Martha","May","Braintree & District AC","F",14,"2010-07-01",3863293,1,"U15G","300m",356323]
[293,"U15G_HJ",1.5,"Martha","May","Braintree & District AC","F",14,"2010-07-01",3863293,1,"U15G","HJ",356323]
[294,"U11G_LJ",3.3,"Ivy","Cain","City of Southend On Sea AC","F",10,"2014-01-30",null,-1,"U11G","LJ",355613]
[295,"VW_100m","0.00.24","Marion","Matthews-Smith","City of Southend On Sea AC","F",69,"1955-02-26",3596410,1,"VW","100m",356357]
[295,"VW_LJ",2,"Marion","Matthews-Smith","City of Southend On Sea AC","F",69,"1955-02-26",3596410,1,"VW","LJ",356357]
[296,"SW_400m","0.01.15","Annabel Nicola","Matthews Smith","City of Southend On Sea AC","F",28,"1996-12-02",2987723,1,"SW","400m",356360]
[296,"SW_800m","00:00:02.400","Annabel Nicola","Matthews Smith","City of Southend On Sea AC","F",28,"1996-12-02",2987723,1,"SW","800m",356360]
[297,"SM_1500m","00:04:05","James","Stewart","Havering AC","M",25,"1999-07-08",3020818,1,"SM","1500m",356370]
[298,"U11B_150m",25,"Leo","Hickey","City of Southend On Sea AC","M",9,"2014-10-13",null,1,"U11B","150m",356372]
[298,"U11B_600m","00:01:55","Leo","Hickey","City of Southend On Sea AC","M",9,"2014-10-13",null,1,"U11B","600m",356372]
[299,"U13G_LJ",3.18,"Ella","Palmer-Traer","City of Southend On Sea AC","F",11,"2012-11-22",4133130,1,"U13G","LJ",356374]
[299,"U13G_SP",4.24,"Ella","Palmer-Traer","City of Southend On Sea AC","F",11,"2012-11-22",4133130,1,"U13G","SP",356374]
[300,"VM_MileWalk",10.3,"Keith","Palmer","City of Southend On Sea AC","M",59,"1964-10-19",2829682,1,"VM","MileWalk",356379]
[301,"U13G_200m",34.5,"Alexandra","Robson","SS Athletics","F",11,"2012-10-29",4113306,1,"U13G","200m",356394]
[301,"U13G_LJ",3.13,"Alexandra","Robson","SS Athletics","F",11,"2012-10-29",4113306,1,"U13G","LJ",356394]
[302,"SW_800m","00:02:40","Rebecca","O'Rourke","Havering AC","F",21,"2003-12-18",3535759,1,"SW","800m",356433]
[303,"U13G_100m",13.94,"Kai","Bucci","SS Athletics","F",12,"2012-08-20",4152192,1,"U13G","100m",356441]
[303,"U13G_200m",29.9,"Kai","Bucci","SS Athletics","F",12,"2012-08-20",4152192,1,"U13G","200m",356441]
[303,"U13G_DT",13,"Kai","Bucci","SS Athletics","F",12,"2012-08-20",4152192,1,"U13G","DT",356441]
[304,"U11B_75m",0,"Tyatt","Cole","City of Southend On Sea AC","M",9,"2014-12-27",null,-1,"U11B","75m",354486]
[304,"U11B_LJ",0,"Tyatt","Cole","City of Southend On Sea AC","M",9,"2014-12-27",null,-1,"U11B","LJ",354486]
[304,"U11B_150m",0,"Tyatt","Cole","City of Southend On Sea AC","M",9,"2014-12-27",null,-1,"U11B","150m",354486]
[305,"U15G_100m",13.5,"Keiki","Bucci","SS Athletics","F",14,"2010-04-15",4128620,1,"U15G","100m",356448]
[305,"U15G_LJ",4.5,"Keiki","Bucci","SS Athletics","F",14,"2010-04-15",4128620,1,"U15G","LJ",356448]
[305,"U15G_SP",7.3,"Keiki","Bucci","SS Athletics","F",14,"2010-04-15",4128620,1,"U15G","SP",356448]
[306,"U11G_600m",10,"Zaeemah","Khan","City of Southend On Sea AC","F",10,"2013-11-06",null,-1,"U11G","600m",355579]
[306,"U11G_75m",10,"Zaeemah","Khan","City of Southend On Sea AC","F",10,"2013-11-06",null,-1,"U11G","75m",355579]
[307,"U11B_75m",5,"Nathan","Balisson","City of Southend On Sea AC","M",9,"2015-01-02",null,-1,"U11B","75m",356450]
[307,"U11B_150m",5,"Nathan","Balisson","City of Southend On Sea AC","M",9,"2015-01-02",null,-1,"U11B","150m",356450]
[307,"U11B_LJ",5,"Nathan","Balisson","City of Southend On Sea AC","M",9,"2015-01-02",null,-1,"U11B","LJ",356450]
[308,"U15G_1500m","00:05:59","Keira","Nix","Basildon AC","F",13,"2011-02-27",4092298,1,"U15G","1500m",356443]
[309,"U13G_100m",0.16,"Anais","Sandell","SS Athletics","F",12,"2012-05-05",4108112,4108112,"U13G","100m",356468]
[309,"U13G_200m",0.35,"Anais","Sandell","SS Athletics","F",12,"2012-05-05",4108112,4108112,"U13G","200m",356468]
[309,"U13G_800m","00:03:20","Anais","Sandell","SS Athletics","F",12,"2012-05-05",4108112,4108112,"U13G","800m",356468]
[310,"U11G_75m",11,"Emily","Lewis","City of Southend On Sea AC","F",9,"2014-12-24",null,1,"U11G","75m",353685]
[310,"U11G_150m",24,"Emily","Lewis","City of Southend On Sea AC","F",9,"2014-12-24",null,1,"U11G","150m",353685]
[310,"U11G_LJ",3.5,"Emily","Lewis","City of Southend On Sea AC","F",9,"2014-12-24",null,1,"U11G","LJ",353685]
[311,"U15G_1500m","00:05:06","Ella","Standring","Ipswich Harriers","F",13,"2010-12-18",4016018,1,"U15G","1500m",356475]
[312,"VM_MileWalk","9.00.00","Stuart","Bennett","Ilford AC","M",66,"1958-08-07",3193811,1,"VM","MileWalk",356478]
[313,"U9B_60m",6,"Brody","Vaughan","SS Athletics","M",7,"2017-05-03",null,-1,"U9B","60m",356479]
[313,"U9B_120m",6,"Brody","Vaughan","SS Athletics","M",7,"2017-05-03",null,-1,"U9B","120m",356479]
[314,"U11B_75m",12,"Joshua","Jackson","City of Southend-on-Sea Athletic Club","M",9,"2015-01-04",null,-1,"U11B","75m",356490]
[314,"U11B_150m",24,"Joshua","Jackson","City of Southend-on-Sea Athletic Club","M",9,"2015-01-04",null,-1,"U11B","150m",356490]
[314,"U11B_LJ",3.1,"Joshua","Jackson","City of Southend-on-Sea Athletic Club","M",9,"2015-01-04",null,-1,"U11B","LJ",356490]
[315,"U13G_100m",14.6,"Amelia-Rose","Turner","SS Athletics","F",11,"2013-02-25",null,-2,"U13G","100m",356503]
[315,"U13G_800m","00:02:45","Amelia-Rose","Turner","SS Athletics","F",11,"2013-02-25",null,-2,"U13G","800m",356503]
[315,"U13G_LJ",3,"Amelia-Rose","Turner","SS Athletics","F",11,"2013-02-25",null,-2,"U13G","LJ",356503]
[316,"U11B_150m",0.3,"Jude","McNicholl","Brentwood Beagles Athletics Club","M",10,"2014-05-28",null,-1,"U11B","150m",356507]
[316,"U11B_600m","00:02:00","Jude","McNicholl","Brentwood Beagles Athletics Club","M",10,"2014-05-28",null,-1,"U11B","600m",356507]
[317,"U13G_800m","00:02:19","Madison","Kindler","Brentwood Beagles Athletics Club","F",11,"2013-06-08",4040657,1,"U13G","800m",353497]
[318,"U17M_1500m","00:04:12.100","Connor","Peck","Ipswich Jaffa RC","M",16,"2008-07-23",4043583,1,"U17M","1500m",356519]
[319,"VM_MileWalk","9.50.00","John","Borgars","Herts Phoenix AC","M",78,"1946-04-21",2694939,1,"VM","MileWalk",356520]
[320,"U11B_75m","2013-11-01","Owen","Cottee","Brentwood Beagles Athletics Club","M",10,"2013-10-21",null,-1,"U11B","75m",353839]
[321,"U11G_75m",12.52,"Clara","Rowles","City of Southend On Sea AC","F",10,"2014-05-02",null,-1,"U11G","75m",356541]
[321,"U11G_150m",25.64,"Clara","Rowles","City of Southend On Sea AC","F",10,"2014-05-02",null,-1,"U11G","150m",356541]
[322,"U7G_50m",9,"Sadie","Abrahams","City of Southend-on-Sea Athletic Club","F",5,"2018-09-07",null,-1,"U7G","50m",356546]
[323,"U13G_100m",0,"Anna","Higgins","SS Athletics","F",11,"2012-10-06",4113313,1,"U13G","100m",356549]
[324,"U13G_200m",25,"Kundai","Ncube","City of Southend On Sea AC","F",12,"2012-05-04",4133127,4133127,"U13G","200m",356551]
[325,"U11G_75m",15,"Ruvarashe","Ncube","City of Southend-on-Sea Athletic Club","F",10,"2014-02-16",null,1,"U11G","75m",356554]
[325,"U11G_150m",20,"Ruvarashe","Ncube","City of Southend-on-Sea Athletic Club","F",10,"2014-02-16",null,1,"U11G","150m",356554]
[325,"U11G_LJ",4,"Ruvarashe","Ncube","City of Southend-on-Sea Athletic Club","F",10,"2014-02-16",null,1,"U11G","LJ",356554]
[326,"U11B_75m",6,"Raheim","Kerr","SS Athletics","M",10,"2013-09-25",4153524,1,"U11B","75m",353802]
[326,"U11B_150m",6,"Raheim","Kerr","SS Athletics","M",10,"2013-09-25",4153524,1,"U11B","150m",353802]
[326,"U11B_600m",6,"Raheim","Kerr","SS Athletics","M",10,"2013-09-25",4153524,1,"U11B","600m",353802]
[327,"U17M_800m","00:01:58","Andrew","Adesanya","City of Southend On Sea AC","M",16,"2008-04-12",4043175,1,"U17M","800m",356558]
[328,"U11G_150m",333,"Orlaith","Hallahan","Unattached","F",9,"2015-03-04",4105524,1,"U11G","150m",354041]
[328,"U11G_LJ",333,"Orlaith","Hallahan","Unattached","F",9,"2015-03-04",4105524,1,"U11G","LJ",354041]
[328,"U11G_600m","00:02:11","Orlaith","Hallahan","Unattached","F",9,"2015-03-04",4105524,1,"U11G","600m",354041]
[329,"U13B_100m",13,"Xavier","Keenan","SS Athletics","M",12,"2011-11-15",4152266,1,"U13B","100m",356570]
[329,"U13B_200m",29,"Xavier","Keenan","SS Athletics","M",12,"2011-11-15",4152266,1,"U13B","200m",356570]
[330,"U13B_800m","00:08:00","Jackson","King-McLeod","Benfleet RC","M",11,"2013-07-16",4116369,0,"U13B","800m",356571]
[331,"U17M_100m",11.35,"Maxwell","Adeosun","Havering AC","M",15,"2009-04-06",4021908,1,"U17M","100m",356569]
[331,"U17M_200m",22.9,"Maxwell","Adeosun","Havering AC","M",15,"2009-04-06",4021908,1,"U17M","200m",356569]
[332,"U13G_800m","00:08:00","Nevaeh","King-McLeod","Benfleet RC","F",11,"2013-07-16",null,-2,"U13G","800m",356575]
[333,"U15G_800m","00:02:20","Summer","Smith","Brentwood Beagles Athletics Club","F",13,"2011-06-10",3913807,1,"U15G","800m",356582]
[334,"U9G_120m","0.30.00","Amalie","Frisby-Bright","Haverhill Running Club","F",8,"2016-05-12",4146586,1,"U9G","120m",356584]
[334,"U9G_400m","1.50.00","Amalie","Frisby-Bright","Haverhill Running Club","F",8,"2016-05-12",4146586,1,"U9G","400m",356584]
[335,"U11G_600m",2.15,"Blossom","Smith","Brentwood Beagles Athletics Club","F",9,"2015-04-10",null,1,"U11G","600m",356586]
[336,"U9G_60m",12,"Willow","Smith","Brentwood Beagles Athletics Club","F",7,"2017-08-31",null,-1,"U9G","60m",356587]
[336,"U9G_400m",1.3,"Willow","Smith","Brentwood Beagles Athletics Club","F",7,"2017-08-31",null,-1,"U9G","400m",356587]
[337,"U17W_800m","00:02:50","Jessica","Heath","Basildon AC","F",16,"2007-09-04",3695552,3695552,"U17W","800m",356588]
[337,"U17W_LJ",4.5,"Jessica","Heath","Basildon AC","F",16,"2007-09-04",3695552,3695552,"U17W","LJ",356588]
[337,"U17W_SP",8.5,"Jessica","Heath","Basildon AC","F",16,"2007-09-04",3695552,3695552,"U17W","SP",356588]
[338,"U11B_600m","00:02:00","Jesse","Geller","Woodford Green AC with Essex Ladies","M",9,"2014-10-06",null,-1,"U11B","600m",356600]
[339,"U11G_75m",2,"Tilly","Williams","SS Athletics","F",9,"2014-10-20",null,-1,"U11G","75m",356256]
[339,"U11G_150m",2,"Tilly","Williams","SS Athletics","F",9,"2014-10-20",null,-1,"U11G","150m",356256]
[339,"U11G_LJ",5,"Tilly","Williams","SS Athletics","F",9,"2014-10-20",null,-1,"U11G","LJ",356256]
[340,"U17M_800m","00:02:08","Caleb","Lee","Colchester Harriers AC","M",16,"2008-01-17",3538559,1,"U17M","800m",356608]
[341,"U15B_800m","00:02:25.600","Hayden","Preston","Colchester Harriers AC","M",13,"2011-06-30",3922862,1,"U15B","800m",356609]
[342,"SM_100m",11.8,"Louis","Berrett","Havering AC","M",22,"2002-02-18",3623727,1,"SM","100m",356610]
[342,"SM_200m",23.5,"Louis","Berrett","Havering AC","M",22,"2002-02-18",3623727,1,"SM","200m",356610]
[342,"SM_400m",51.9,"Louis","Berrett","Havering AC","M",22,"2002-02-18",3623727,1,"SM","400m",356610]
[343,"VM_200m",30,"Paul","Berrett","Havering AC","M",62,"1961-11-14",2724667,1,"VM","200m",356612]
[343,"VM_400m",65,"Paul","Berrett","Havering AC","M",62,"1961-11-14",2724667,1,"VM","400m",356612]
[344,"U17M_400m",55,"Harry","Lee","Chelmsford AC","M",15,"2008-10-02",3949160,1,"U17M","400m",356616]
[344,"U17M_LJ",6,"Harry","Lee","Chelmsford AC","M",15,"2008-10-02",3949160,1,"U17M","LJ",356616]
[344,"U17M_DT",31,"Harry","Lee","Chelmsford AC","M",15,"2008-10-02",3949160,1,"U17M","DT",356616]
[345,"VW_100m","0.21.07","Linda","Donnelly","City of Southend On Sea AC","F",66,"1957-10-13",3743015,1,"VW","100m",356617]
[345,"VW_200m","0.43.6","Linda","Donnelly","City of Southend On Sea AC","F",66,"1957-10-13",3743015,1,"VW","200m",356617]
[345,"VW_400m","1:41.01.","Linda","Donnelly","City of Southend On Sea AC","F",66,"1957-10-13",3743015,1,"VW","400m",356617]
[345,"VW_800m","00:04:34.100","Linda","Donnelly","City of Southend On Sea AC","F",66,"1957-10-13",3743015,1,"VW","800m",356617]
[345,"VW_1500m","00:08:17.100","Linda","Donnelly","City of Southend On Sea AC","F",66,"1957-10-13",3743015,1,"VW","1500m",356617]
[345,"VW_LJ",2.2400000000000002,"Linda","Donnelly","City of Southend On Sea AC","F",66,"1957-10-13",3743015,1,"VW","LJ",356617]
[345,"VW_HJ",1.05,"Linda","Donnelly","City of Southend On Sea AC","F",66,"1957-10-13",3743015,1,"VW","HJ",356617]
[345,"VW_SP",5.47,"Linda","Donnelly","City of Southend On Sea AC","F",66,"1957-10-13",3743015,1,"VW","SP",356617]
[346,"VM_400m","0.58.2","Scott","Brewer","Thames Valley Harriers","M",38,"1986-08-25",3419965,1,"VM","400m",356621]
[347,"U13G_800m","00:03:20","Grace","Crawford","SS Athletics","F",11,"2012-11-11",4152193,1,"U13G","800m",356622]
[348,"U15G_200m",26.5,"Elle","Behari","Newham & Essex Beagles AC","F",14,"2010-07-06",3978320,1,"U15G","200m",356623]
[349,"VW_1500m","00:05:30","Laura","Shewbridge","Unattached","F",42,"1981-12-19",2672426,2672426,"VW","1500m",356627]
[350,"U15G_1500m","00:05:03.200","Isabel","Forrest","Brentwood Beagles Athletics Club","F",14,"2010-07-24",3875620,1,"U15G","1500m",356628]
[351,"U7B_50m",13,"Ben","Brazier","SS Athletics","M",6,"2018-05-27",null,1,"U7B","50m",356629]
[352,"VW_100m",16.7,"Deborah","Hill","Fordy Runs Running Club","F",53,"1971-06-04",3971226,3971226,"VW","100m",356632]
[353,"U17M_100m",11.7,"Jerome","Whiteley","City of Southend On Sea AC","M",15,"2008-09-04",4043190,1,"U17M","100m",356337]
[353,"U17M_200m",23.2,"Jerome","Whiteley","City of Southend On Sea AC","M",15,"2008-09-04",4043190,1,"U17M","200m",356337]
[354,"U15G_HJ",1.45,"Ava","Bailey","Basildon AC","F",14,"2010-08-20",3986238,1,"U15G","HJ",356649]
[355,"U17M_100m",11.01,"David","Bajela","City of Southend On Sea AC","M",15,"2008-10-18",4065487,1,"U17M","100m",356654]
[355,"U17M_200m",23.5,"David","Bajela","City of Southend On Sea AC","M",15,"2008-10-18",4065487,1,"U17M","200m",356654]
[355,"U17M_LJ",5.83,"David","Bajela","City of Southend On Sea AC","M",15,"2008-10-18",4065487,1,"U17M","LJ",356654]
[356,"U15B_100m",13.5,"Isaac","Bajela","City of Southend On Sea AC","M",14,"2010-04-08",4089442,1,"U15B","100m",356656]
[356,"U15B_200m",29.6,"Isaac","Bajela","City of Southend On Sea AC","M",14,"2010-04-08",4089442,1,"U15B","200m",356656]
[356,"U15B_DT",16.2,"Isaac","Bajela","City of Southend On Sea AC","M",14,"2010-04-08",4089442,1,"U15B","DT",356656]
[357,"U17W_DT",22,"Maddie","Verilllo","Unattached","F",16,"2008-08-11",null,-1,"U17W","DT",356674]
[358,"VM_100m",13,"Greg","Goodrem","City of Southend On Sea AC","M",40,"1983-09-14",2912893,1,"VM","100m",356675]
[358,"VM_HJ",170,"Greg","Goodrem","City of Southend On Sea AC","M",40,"1983-09-14",2912893,1,"VM","HJ",356675]
[359,"U9B_60m",15,"Billy","Noble","SS Athletics","M",8,"2016-02-15",null,1,"U9B","60m",356677]
[360,"U15G_HJ",1.4,"Charlotte","Sumner","SS Athletics","F",13,"2010-09-13",4137271,1,"U15G","HJ",356679]
[361,"U11B_75m",14,"Frankie","Noble","SS Athletics","M",9,"2015-04-03",null,1,"U11B","75m",356680]
[362,"U13B_HJ",1.4,"Henry","Sumner","SS Athletics","M",12,"2012-03-21",4142523,1,"U13B","HJ",356681]
[363,"U9G_60m","00.10.03","Elise","Gosling","Brentwood Beagles Athletics Club","F",8,"2015-09-16",null,-1,"U9G","60m",356684]
[363,"U9G_120m","00.19.00","Elise","Gosling","Brentwood Beagles Athletics Club","F",8,"2015-09-16",null,-1,"U9G","120m",356684]
[363,"U9G_400m","01.30.00","Elise","Gosling","Brentwood Beagles Athletics Club","F",8,"2015-09-16",null,-1,"U9G","400m",356684]
[364,"U11B_75m",13,"Tom","Kulahcigil","Unattached","M",10,"2013-09-02",null,-1,"U11B","75m",356688]
[365,"U9G_120m",4,"Abriella","Bridge","City of Southend On Sea AC","F",8,"2015-11-02",null,-1,"U9G","120m",356689]
[366,"U15B_HJ",1.4,"Theo","Copsey","City of Southend On Sea AC","M",13,"2010-12-23",4088096,0,"U15B","HJ",356496]
[367,"U20M_800m","00:02:10","Dean","Savery","Brentwood Beagles Athletics Club","M",18,"2006-12-15",4052266,1,"U20M","800m",356696]
[368,"U11G_75m",4,"Chloe-Anne","Howard","SS Athletics","F",10,"2014-08-28",null,-1,"U11G","75m",356697]
[368,"U11G_600m",3,"Chloe-Anne","Howard","SS Athletics","F",10,"2014-08-28",null,-1,"U11G","600m",356697]
[369,"U13B_100m",13.1,"Dylan","Cordell","SS Athletics","M",12,"2012-01-06",4158157,1,"U13B","100m",356700]
[369,"U13B_HJ",1.4,"Dylan","Cordell","SS Athletics","M",12,"2012-01-06",4158157,1,"U13B","HJ",356700]
[370,"U13B_1500m","00:06:00","Mason","Partridge","Colchester & Tendring AC","M",11,"2013-04-22",4089812,1,"U13B","1500m",356701]
[370,"U13B_LJ",3.5,"Mason","Partridge","Colchester & Tendring AC","M",11,"2013-04-22",4089812,1,"U13B","LJ",356701]
[370,"U13B_HJ",1.25,"Mason","Partridge","Colchester & Tendring AC","M",11,"2013-04-22",4089812,1,"U13B","HJ",356701]
[371,"U20M_100m",11.9,"Kinyo","Okenla","Basildon AC","M",17,"2007-03-29",3836512,1,"U20M","100m",356703]
[371,"U20M_200m",24.7,"Kinyo","Okenla","Basildon AC","M",17,"2007-03-29",3836512,1,"U20M","200m",356703]
[372,"U15B_800m","00:02:23","Jackson","Mendoza","City of Southend On Sea AC","M",14,"2010-01-25",4153195,1,"U15B","800m",356705]
[373,"U13B_200m",30,"Tobias","Low","SS Athletics","M",12,"2012-04-22",4152191,1,"U13B","200m",356706]
[374,"U15B_100m",12.2,"Daniel","Mendoza","City of Southend On Sea AC","M",14,"2010-01-25",4153194,1,"U15B","100m",356707]
[374,"U15B_200m",26,"Daniel","Mendoza","City of Southend On Sea AC","M",14,"2010-01-25",4153194,1,"U15B","200m",356707]
[375,"U11G_150m",26,"Naomi","Heath","SS Athletics","F",10,"2013-11-26",4043653,1,"U11G","150m",356710]
[375,"U11G_600m","00:02:30","Naomi","Heath","SS Athletics","F",10,"2013-11-26",4043653,1,"U11G","600m",356710]
[375,"U11G_LJ",3,"Naomi","Heath","SS Athletics","F",10,"2013-11-26",4043653,1,"U11G","LJ",356710]
[376,"VM_800m","00:02:40","Nick","Mendoza","Unattached","M",44,"1980-01-23",4081362,0,"VM","800m",356711]
[377,"U11B_75m",14.54,"Olly","M Kelly","Ipswich Jaffa RC","M",10,"2014-03-22",4043582,1,"U11B","75m",356712]
[377,"U11B_600m","00:02:22.900","Olly","M Kelly","Ipswich Jaffa RC","M",10,"2014-03-22",4043582,1,"U11B","600m",356712]
[377,"U11B_LJ",2.35,"Olly","M Kelly","Ipswich Jaffa RC","M",10,"2014-03-22",4043582,1,"U11B","LJ",356712]
[378,"U13B_1500m","00:06:00","James","Bilby","Unattached","M",12,"2011-09-01",4148687,1,"U13B","1500m",356715]
[379,"VM_MileWalk",10,"Philip","Barnard","Ilford AC","M",40,"1984-01-11",2983375,0,"VM","MileWalk",356716]
[380,"U15G_800m",6,"Charlotte","Bilby","Unattached","F",14,"2009-09-17",null,-1,"U15G","800m",356718]
[381,"U15B_100m",15,"Ronnie","Noble","SS Athletics","M",13,"2011-07-10",4105344,null,"U15B","100m"]
[382,"VW_1500m","5m","Amanda","Dodge","JBR Run & Tri","F",41,"1983-01-11",1234567,null,"VW","1500m",123456]

{"sheet":"1M Walk","index":1,"n_rows":42,"n_cols":16,"rows_kept":42,"cut":false,"hidden":false,"merged":[]}
["One Mile Walk"]
[]
["Veteran Men",null,null,null,null,null,null,null,null,"Veteran Women"]
["Pos","Number","Last Name","First Name","Age","Club","Time",null,null,"Pos","Number","Last Name","First Name","Age","Club","Time"]
[1,379,{"$f":"IFERROR(VLOOKUP(B5,Entries!$A:$E,5,0),\"-\")","v":"Barnard"},{"$f":"IFERROR(VLOOKUP(B5,Entries!$A:$D,4,0),\"-\")","v":"Philip"},{"$f":"IFERROR(VLOOKUP(B5,Entries!$A:$H,8,0),\"-\")","v":40},{"$f":"IFERROR(VLOOKUP(B5,Entries!$A:$F,6,0),\"-\")","v":"Ilford AC"},"00:07:36.400",null,null,1,384,"Dyos ","Emma ","W45","Brentwood ","00:08:44.900"]
[2,312,{"$f":"IFERROR(VLOOKUP(B6,Entries!$A:$E,5,0),\"-\")","v":"Bennett"},{"$f":"IFERROR(VLOOKUP(B6,Entries!$A:$D,4,0),\"-\")","v":"Stuart"},{"$f":"IFERROR(VLOOKUP(B6,Entries!$A:$H,8,0),\"-\")","v":66},{"$f":"IFERROR(VLOOKUP(B6,Entries!$A:$F,6,0),\"-\")","v":"Ilford AC"},"00:09:10.800",null,null,2,112,{"$f":"IFERROR(VLOOKUP(K6,Entries!$A:$E,5,0),\"-\")","v":"Mountford"},{"$f":"IFERROR(VLOOKUP(K6,Entries!$A:$D,4,0),\"-\")","v":"Linda"},{"$f":"IFERROR(VLOOKUP(K6,Entries!$A:$H,8,0),\"-\")","v":58},{"$f":"IFERROR(VLOOKUP(K6,Entries!$A:$F,6,0),\"-\")","v":"Unattached"},"00:09:57.800"]
[3,383,"Harle","Colin","65 - 69 ","Belgrave ","00:09:21.900",null,null,3,44,{"$f":"IFERROR(VLOOKUP(K7,Entries!$A:$E,5,0),\"-\")","v":"McTeer"},{"$f":"IFERROR(VLOOKUP(K7,Entries!$A:$D,4,0),\"-\")","v":"Kirsten"},{"$f":"IFERROR(VLOOKUP(K7,Entries!$A:$H,8,0),\"-\")","v":49},{"$f":"IFERROR(VLOOKUP(K7,Entries!$A:$F,6,0),\"-\")","v":"Central Park Athletics"},"00:10:49.400"]
[4,179,{"$f":"IFERROR(VLOOKUP(B8,Entries!$A:$E,5,0),\"-\")","v":"Allen"},{"$f":"IFERROR(VLOOKUP(B8,Entries!$A:$D,4,0),\"-\")","v":"Steve"},{"$f":"IFERROR(VLOOKUP(B8,Entries!$A:$H,8,0),\"-\")","v":66},{"$f":"IFERROR(VLOOKUP(B8,Entries!$A:$F,6,0),\"-\")","v":"Ilford AC"},"00:10:06.200",null,null,4,386,"Brown","Sarah","W45","Colchester & Tendering ","00:10:58.300"]
[5,210,{"$f":"IFERROR(VLOOKUP(B9,Entries!$A:$E,5,0),\"-\")","v":"Maskell"},{"$f":"IFERROR(VLOOKUP(B9,Entries!$A:$D,4,0),\"-\")","v":"Richard"},{"$f":"IFERROR(VLOOKUP(B9,Entries!$A:$H,8,0),\"-\")","v":48},{"$f":"IFERROR(VLOOKUP(B9,Entries!$A:$F,6,0),\"-\")","v":"City of Southend-on-Sea Athletic Club"},"00:10:13.500",null,null,5,389,"Palmer","Emma ","W50","City of Southend on Sea","00:12:35.900"]
[6,129,{"$f":"IFERROR(VLOOKUP(B10,Entries!$A:$E,5,0),\"-\")","v":"Taylor"},{"$f":"IFERROR(VLOOKUP(B10,Entries!$A:$D,4,0),\"-\")","v":"John"},{"$f":"IFERROR(VLOOKUP(B10,Entries!$A:$H,8,0),\"-\")","v":69},{"$f":"IFERROR(VLOOKUP(B10,Entries!$A:$F,6,0),\"-\")","v":"Brentwood Beagles Athletics Club"},"00:10:24.800",null,null,6,388,"Fox ","Selina ","W38","City of Southend on Sea","00:13:57.600"]
[7,300,{"$f":"IFERROR(VLOOKUP(B11,Entries!$A:$E,5,0),\"-\")","v":"Palmer"},{"$f":"IFERROR(VLOOKUP(B11,Entries!$A:$D,4,0),\"-\")","v":"Keith"},{"$f":"IFERROR(VLOOKUP(B11,Entries!$A:$H,8,0),\"-\")","v":59},{"$f":"IFERROR(VLOOKUP(B11,Entries!$A:$F,6,0),\"-\")","v":"City of Southend On Sea AC"},"00:10:28.100",null,null,7,385,"Mountford","Val","W79","Unattached","00:14:16.800"]
[8,319,{"$f":"IFERROR(VLOOKUP(B12,Entries!$A:$E,5,0),\"-\")","v":"Borgars"},{"$f":"IFERROR(VLOOKUP(B12,Entries!$A:$D,4,0),\"-\")","v":"John"},{"$f":"IFERROR(VLOOKUP(B12,Entries!$A:$H,8,0),\"-\")","v":78},{"$f":"IFERROR(VLOOKUP(B12,Entries!$A:$F,6,0),\"-\")","v":"Herts Phoenix AC"},"00:10:33.700"," ",null,8,null,{"$f":"IFERROR(VLOOKUP(K12,Entries!$A:$E,5,0),\"-\")","v":"-"},{"$f":"IFERROR(VLOOKUP(K12,Entries!$A:$D,4,0),\"-\")","v":"-"},{"$f":"IFERROR(VLOOKUP(K12,Entries!$A:$H,8,0),\"-\")","v":"-"},{"$f":"IFERROR(VLOOKUP(K12,Entries!$A:$F,6,0),\"-\")","v":"-"}]
[9,387,"O'Rawe","Alan","M80","Unattached","00:12:26.800",null,null,9,null,{"$f":"IFERROR(VLOOKUP(K13,Entries!$A:$E,5,0),\"-\")","v":"-"},{"$f":"IFERROR(VLOOKUP(K13,Entries!$A:$D,4,0),\"-\")","v":"-"},{"$f":"IFERROR(VLOOKUP(K13,Entries!$A:$H,8,0),\"-\")","v":"-"},{"$f":"IFERROR(VLOOKUP(K13,Entries!$A:$F,6,0),\"-\")","v":"-"}]
[10,188,{"$f":"IFERROR(VLOOKUP(B14,Entries!$A:$E,5,0),\"-\")","v":"Ainsworth"},{"$f":"IFERROR(VLOOKUP(B14,Entries!$A:$D,4,0),\"-\")","v":"David"},{"$f":"IFERROR(VLOOKUP(B14,Entries!$A:$H,8,0),\"-\")","v":76},{"$f":"IFERROR(VLOOKUP(B14,Entries!$A:$F,6,0),\"-\")","v":"Ilford AC"},"00:13:48.200",null,null,10,null,{"$f":"IFERROR(VLOOKUP(K14,Entries!$A:$E,5,0),\"-\")","v":"-"},{"$f":"IFERROR(VLOOKUP(K14,Entries!$A:$D,4,0),\"-\")","v":"-"},{"$f":"IFERROR(VLOOKUP(K14,Entries!$A:$H,8,0),\"-\")","v":"-"},{"$f":"IFERROR(VLOOKUP(K14,Entries!$A:$F,6,0),\"-\")","v":"-"}]
[]
[]
["U13B",null,null,null,null,null,null,null,null,"U17W"]
["Pos","Number","Last Name","First Name","Age","Club","Time",null,null,"Pos","Number","Last Name","First Name","Age","Club","Time"]
[1,45,{"$f":"IFERROR(VLOOKUP(B19,Entries!$A:$E,5,0),\"-\")","v":"McTeer"},{"$f":"IFERROR(VLOOKUP(B19,Entries!$A:$D,4,0),\"-\")","v":"Rowan"},{"$f":"IFERROR(VLOOKUP(B19,Entries!$A:$H,8,0),\"-\")","v":11},{"$f":"IFERROR(VLOOKUP(B19,Entries!$A:$F,6,0),\"-\")","v":"Central Park Athletics"},"00:10:22.300",null,null,1,285,{"$f":"IFERROR(VLOOKUP(K19,Entries!$A:$E,5,0),\"-\")","v":"Heaton"},{"$f":"IFERROR(VLOOKUP(K19,Entries!$A:$D,4,0),\"-\")","v":"Tilly"},{"$f":"IFERROR(VLOOKUP(K19,Entries!$A:$H,8,0),\"-\")","v":15},{"$f":"IFERROR(VLOOKUP(K19,Entries!$A:$F,6,0),\"-\")","v":"Castle Point Joggers"},"00:10:40.500"]
[2,null,{"$f":"IFERROR(VLOOKUP(B20,Entries!$A:$E,5,0),\"-\")","v":"-"},{"$f":"IFERROR(VLOOKUP(B20,Entries!$A:$D,4,0),\"-\")","v":"-"},{"$f":"IFERROR(VLOOKUP(B20,Entries!$A:$H,8,0),\"-\")","v":"-"},{"$f":"IFERROR(VLOOKUP(B20,Entries!$A:$F,6,0),\"-\")","v":"-"},null,null,null,2,null,{"$f":"IFERROR(VLOOKUP(K20,Entries!$A:$E,5,0),\"-\")","v":"-"},{"$f":"IFERROR(VLOOKUP(K20,Entries!$A:$D,4,0),\"-\")","v":"-"},{"$f":"IFERROR(VLOOKUP(K20,Entries!$A:$H,8,0),\"-\")","v":"-"},{"$f":"IFERROR(VLOOKUP(K20,Entries!$A:$F,6,0),\"-\")","v":"-"}]
[3,null,{"$f":"IFERROR(VLOOKUP(B21,Entries!$A:$E,5,0),\"-\")","v":"-"},{"$f":"IFERROR(VLOOKUP(B21,Entries!$A:$D,4,0),\"-\")","v":"-"},{"$f":"IFERROR(VLOOKUP(B21,Entries!$A:$H,8,0),\"-\")","v":"-"},{"$f":"IFERROR(VLOOKUP(B21,Entries!$A:$F,6,0),\"-\")","v":"-"},null,null,null,3,null,{"$f":"IFERROR(VLOOKUP(K21,Entries!$A:$E,5,0),\"-\")","v":"-"},{"$f":"IFERROR(VLOOKUP(K21,Entries!$A:$D,4,0),\"-\")","v":"-"},{"$f":"IFERROR(VLOOKUP(K21,Entries!$A:$H,8,0),\"-\")","v":"-"},{"$f":"IFERROR(VLOOKUP(K21,Entries!$A:$F,6,0),\"-\")","v":"-"}]
[4,null,{"$f":"IFERROR(VLOOKUP(B22,Entries!$A:$E,5,0),\"-\")","v":"-"},{"$f":"IFERROR(VLOOKUP(B22,Entries!$A:$D,4,0),\"-\")","v":"-"},{"$f":"IFERROR(VLOOKUP(B22,Entries!$A:$H,8,0),\"-\")","v":"-"},{"$f":"IFERROR(VLOOKUP(B22,Entries!$A:$F,6,0),\"-\")","v":"-"},null,null,null,4,null,{"$f":"IFERROR(VLOOKUP(K22,Entries!$A:$E,5,0),\"-\")","v":"-"},{"$f":"IFERROR(VLOOKUP(K22,Entries!$A:$D,4,0),\"-\")","v":"-"},{"$f":"IFERROR(VLOOKUP(K22,Entries!$A:$H,8,0),\"-\")","v":"-"},{"$f":"IFERROR(VLOOKUP(K22,Entries!$A:$F,6,0),\"-\")","v":"-"}]
[5,null,{"$f":"IFERROR(VLOOKUP(B23,Entries!$A:$E,5,0),\"-\")","v":"-"},{"$f":"IFERROR(VLOOKUP(B23,Entries!$A:$D,4,0),\"-\")","v":"-"},{"$f":"IFERROR(VLOOKUP(B23,Entries!$A:$H,8,0),\"-\")","v":"-"},{"$f":"IFERROR(VLOOKUP(B23,Entries!$A:$F,6,0),\"-\")","v":"-"},null,null,null,5,null,{"$f":"IFERROR(VLOOKUP(K23,Entries!$A:$E,5,0),\"-\")","v":"-"},{"$f":"IFERROR(VLOOKUP(K23,Entries!$A:$D,4,0),\"-\")","v":"-"},{"$f":"IFERROR(VLOOKUP(K23,Entries!$A:$H,8,0),\"-\")","v":"-"},{"$f":"IFERROR(VLOOKUP(K23,Entries!$A:$F,6,0),\"-\")","v":"-"}]
[6,null,{"$f":"IFERROR(VLOOKUP(B24,Entries!$A:$E,5,0),\"-\")","v":"-"},{"$f":"IFERROR(VLOOKUP(B24,Entries!$A:$D,4,0),\"-\")","v":"-"},{"$f":"IFERROR(VLOOKUP(B24,Entries!$A:$H,8,0),\"-\")","v":"-"},{"$f":"IFERROR(VLOOKUP(B24,Entries!$A:$F,6,0),\"-\")","v":"-"},null,null,null,6,null,{"$f":"IFERROR(VLOOKUP(K24,Entries!$A:$E,5,0),\"-\")","v":"-"},{"$f":"IFERROR(VLOOKUP(K24,Entries!$A:$D,4,0),\"-\")","v":"-"},{"$f":"IFERROR(VLOOKUP(K24,Entries!$A:$H,8,0),\"-\")","v":"-"},{"$f":"IFERROR(VLOOKUP(K24,Entries!$A:$F,6,0),\"-\")","v":"-"}]
[7,null,{"$f":"IFERROR(VLOOKUP(B25,Entries!$A:$E,5,0),\"-\")","v":"-"},{"$f":"IFERROR(VLOOKUP(B25,Entries!$A:$D,4,0),\"-\")","v":"-"},{"$f":"IFERROR(VLOOKUP(B25,Entries!$A:$H,8,0),\"-\")","v":"-"},{"$f":"IFERROR(VLOOKUP(B25,Entries!$A:$F,6,0),\"-\")","v":"-"},null,null,null,7,null,{"$f":"IFERROR(VLOOKUP(K25,Entries!$A:$E,5,0),\"-\")","v":"-"},{"$f":"IFERROR(VLOOKUP(K25,Entries!$A:$D,4,0),\"-\")","v":"-"},{"$f":"IFERROR(VLOOKUP(K25,Entries!$A:$H,8,0),\"-\")","v":"-"},{"$f":"IFERROR(VLOOKUP(K25,Entries!$A:$F,6,0),\"-\")","v":"-"}]
[8,null,{"$f":"IFERROR(VLOOKUP(B26,Entries!$A:$E,5,0),\"-\")","v":"-"},{"$f":"IFERROR(VLOOKUP(B26,Entries!$A:$D,4,0),\"-\")","v":"-"},{"$f":"IFERROR(VLOOKUP(B26,Entries!$A:$H,8,0),\"-\")","v":"-"},{"$f":"IFERROR(VLOOKUP(B26,Entries!$A:$F,6,0),\"-\")","v":"-"},null,null,null,8,null,{"$f":"IFERROR(VLOOKUP(K26,Entries!$A:$E,5,0),\"-\")","v":"-"},{"$f":"IFERROR(VLOOKUP(K26,Entries!$A:$D,4,0),\"-\")","v":"-"},{"$f":"IFERROR(VLOOKUP(K26,Entries!$A:$H,8,0),\"-\")","v":"-"},{"$f":"IFERROR(VLOOKUP(K26,Entries!$A:$F,6,0),\"-\")","v":"-"}]
[9,null,{"$f":"IFERROR(VLOOKUP(B27,Entries!$A:$E,5,0),\"-\")","v":"-"},{"$f":"IFERROR(VLOOKUP(B27,Entries!$A:$D,4,0),\"-\")","v":"-"},{"$f":"IFERROR(VLOOKUP(B27,Entries!$A:$H,8,0),\"-\")","v":"-"},{"$f":"IFERROR(VLOOKUP(B27,Entries!$A:$F,6,0),\"-\")","v":"-"},null,null,null,9,null,{"$f":"IFERROR(VLOOKUP(K27,Entries!$A:$E,5,0),\"-\")","v":"-"},{"$f":"IFERROR(VLOOKUP(K27,Entries!$A:$D,4,0),\"-\")","v":"-"},{"$f":"IFERROR(VLOOKUP(K27,Entries!$A:$H,8,0),\"-\")","v":"-"},{"$f":"IFERROR(VLOOKUP(K27,Entries!$A:$F,6,0),\"-\")","v":"-"}]
[10,null,{"$f":"IFERROR(VLOOKUP(B28,Entries!$A:$E,5,0),\"-\")","v":"-"},{"$f":"IFERROR(VLOOKUP(B28,Entries!$A:$D,4,0),\"-\")","v":"-"},{"$f":"IFERROR(VLOOKUP(B28,Entries!$A:$H,8,0),\"-\")","v":"-"},{"$f":"IFERROR(VLOOKUP(B28,Entries!$A:$F,6,0),\"-\")","v":"-"},null,null,null,10,null,{"$f":"IFERROR(VLOOKUP(K28,Entries!$A:$E,5,0),\"-\")","v":"-"},{"$f":"IFERROR(VLOOKUP(K28,Entries!$A:$D,4,0),\"-\")","v":"-"},{"$f":"IFERROR(VLOOKUP(K28,Entries!$A:$H,8,0),\"-\")","v":"-"},{"$f":"IFERROR(VLOOKUP(K28,Entries!$A:$F,6,0),\"-\")","v":"-"}]
[]
[]
[null,null,null,null,null,null,null,null,null,"U15G"]
[null,null,null,null,null,null,null,null,null,"Pos","Number","Last Name","First Name","Age","Club","Time"]
[null,null,null,null,null,null,null,null,null,1,198,{"$f":"IFERROR(VLOOKUP(K33,Entries!$A:$E,5,0),\"-\")","v":"Hawkins"},{"$f":"IFERROR(VLOOKUP(K33,Entries!$A:$D,4,0),\"-\")","v":"Katie"},{"$f":"IFERROR(VLOOKUP(K33,Entries!$A:$H,8,0),\"-\")","v":14},{"$f":"IFERROR(VLOOKUP(K33,Entries!$A:$F,6,0),\"-\")","v":"Brentwood Beagles Athletics Club"},"00:11:31.700"]
[null,null,null,null,null,null,null,null,null,2,null,{"$f":"IFERROR(VLOOKUP(K34,Entries!$A:$E,5,0),\"-\")","v":"-"},{"$f":"IFERROR(VLOOKUP(K34,Entries!$A:$D,4,0),\"-\")","v":"-"},{"$f":"IFERROR(VLOOKUP(K34,Entries!$A:$H,8,0),\"-\")","v":"-"},{"$f":"IFERROR(VLOOKUP(K34,Entries!$A:$F,6,0),\"-\")","v":"-"}]
[null,null,null,null,null,null,null,null,null,3,null,{"$f":"IFERROR(VLOOKUP(K35,Entries!$A:$E,5,0),\"-\")","v":"-"},{"$f":"IFERROR(VLOOKUP(K35,Entries!$A:$D,4,0),\"-\")","v":"-"},{"$f":"IFERROR(VLOOKUP(K35,Entries!$A:$H,8,0),\"-\")","v":"-"},{"$f":"IFERROR(VLOOKUP(K35,Entries!$A:$F,6,0),\"-\")","v":"-"}]
[null,null,null,null,null,null,null,null,null,4,null,{"$f":"IFERROR(VLOOKUP(K36,Entries!$A:$E,5,0),\"-\")","v":"-"},{"$f":"IFERROR(VLOOKUP(K36,Entries!$A:$D,4,0),\"-\")","v":"-"},{"$f":"IFERROR(VLOOKUP(K36,Entries!$A:$H,8,0),\"-\")","v":"-"},{"$f":"IFERROR(VLOOKUP(K36,Entries!$A:$F,6,0),\"-\")","v":"-"}]
[null,null,null,null,null,null,null,null,null,5,null,{"$f":"IFERROR(VLOOKUP(K37,Entries!$A:$E,5,0),\"-\")","v":"-"},{"$f":"IFERROR(VLOOKUP(K37,Entries!$A:$D,4,0),\"-\")","v":"-"},{"$f":"IFERROR(VLOOKUP(K37,Entries!$A:$H,8,0),\"-\")","v":"-"},{"$f":"IFERROR(VLOOKUP(K37,Entries!$A:$F,6,0),\"-\")","v":"-"}]
[null,null,null,null,null,null,null,null,null,6,null,{"$f":"IFERROR(VLOOKUP(K38,Entries!$A:$E,5,0),\"-\")","v":"-"},{"$f":"IFERROR(VLOOKUP(K38,Entries!$A:$D,4,0),\"-\")","v":"-"},{"$f":"IFERROR(VLOOKUP(K38,Entries!$A:$H,8,0),\"-\")","v":"-"},{"$f":"IFERROR(VLOOKUP(K38,Entries!$A:$F,6,0),\"-\")","v":"-"}]
[null,null,null,null,null,null,null,null,null,7,null,{"$f":"IFERROR(VLOOKUP(K39,Entries!$A:$E,5,0),\"-\")","v":"-"},{"$f":"IFERROR(VLOOKUP(K39,Entries!$A:$D,4,0),\"-\")","v":"-"},{"$f":"IFERROR(VLOOKUP(K39,Entries!$A:$H,8,0),\"-\")","v":"-"},{"$f":"IFERROR(VLOOKUP(K39,Entries!$A:$F,6,0),\"-\")","v":"-"}]
[null,null,null,null,null,null,null,null,null,8,null,{"$f":"IFERROR(VLOOKUP(K40,Entries!$A:$E,5,0),\"-\")","v":"-"},{"$f":"IFERROR(VLOOKUP(K40,Entries!$A:$D,4,0),\"-\")","v":"-"},{"$f":"IFERROR(VLOOKUP(K40,Entries!$A:$H,8,0),\"-\")","v":"-"},{"$f":"IFERROR(VLOOKUP(K40,Entries!$A:$F,6,0),\"-\")","v":"-"}]
[null,null,null,null,null,null,null,null,null,9,null,{"$f":"IFERROR(VLOOKUP(K41,Entries!$A:$E,5,0),\"-\")","v":"-"},{"$f":"IFERROR(VLOOKUP(K41,Entries!$A:$D,4,0),\"-\")","v":"-"},{"$f":"IFERROR(VLOOKUP(K41,Entries!$A:$H,8,0),\"-\")","v":"-"},{"$f":"IFERROR(VLOOKUP(K41,Entries!$A:$F,6,0),\"-\")","v":"-"}]
[null,null,null,null,null,null,null,null,null,10,null,{"$f":"IFERROR(VLOOKUP(K42,Entries!$A:$E,5,0),\"-\")","v":"-"},{"$f":"IFERROR(VLOOKUP(K42,Entries!$A:$D,4,0),\"-\")","v":"-"},{"$f":"IFERROR(VLOOKUP(K42,Entries!$A:$H,8,0),\"-\")","v":"-"},{"$f":"IFERROR(VLOOKUP(K42,Entries!$A:$F,6,0),\"-\")","v":"-"}]

{"sheet":"50m","index":2,"n_rows":28,"n_cols":15,"rows_kept":28,"cut":false,"hidden":false,"merged":[]}
["50m","U11 Year 1 and 2"]
[]
["U9 Boys","Heat 1",null,null,null,"Wind",null,null,"U9 Girls",null,null,null,null,"Wind"]
["Pos","Number","Last Name","First Name","Age","Club","Time",null,"Pos","Number","Last Name","First Name","Age","Club","Time"]
[1,6,{"$f":"IFERROR(VLOOKUP(B5,Entries!$A:$E,5,0),\"-\")","v":"Brown"},{"$f":"IFERROR(VLOOKUP(B5,Entries!$A:$D,4,0),\"-\")","v":"Leo"},{"$f":"IFERROR(VLOOKUP(B5,Entries!$A:$H,8,0),\"-\")","v":6},{"$f":"IFERROR(VLOOKUP(B5,Entries!$A:$F,6,0),\"-\")","v":"SS Athletics"},9.93,null,1,10,{"$f":"IFERROR(VLOOKUP(J5,Entries!$A:$E,5,0),\"-\")","v":"Brewington"},{"$f":"IFERROR(VLOOKUP(J5,Entries!$A:$D,4,0),\"-\")","v":"Freya"},{"$f":"IFERROR(VLOOKUP(J5,Entries!$A:$H,8,0),\"-\")","v":5},{"$f":"IFERROR(VLOOKUP(J5,Entries!$A:$F,6,0),\"-\")","v":"Brentwood Beagles Athletics Club"},"NO TIME "]
[2,3,{"$f":"IFERROR(VLOOKUP(B6,Entries!$A:$E,5,0),\"-\")","v":"Awoyode"},{"$f":"IFERROR(VLOOKUP(B6,Entries!$A:$D,4,0),\"-\")","v":"Joseph"},{"$f":"IFERROR(VLOOKUP(B6,Entries!$A:$H,8,0),\"-\")","v":5},{"$f":"IFERROR(VLOOKUP(B6,Entries!$A:$F,6,0),\"-\")","v":"Unattached"},10.130000000000001,null,2,16,{"$f":"IFERROR(VLOOKUP(J6,Entries!$A:$E,5,0),\"-\")","v":"Ngala"},{"$f":"IFERROR(VLOOKUP(J6,Entries!$A:$D,4,0),\"-\")","v":"Meghan"},{"$f":"IFERROR(VLOOKUP(J6,Entries!$A:$H,8,0),\"-\")","v":5},{"$f":"IFERROR(VLOOKUP(J6,Entries!$A:$F,6,0),\"-\")","v":"Unattached"},"NO TIME "]
[3,187,{"$f":"IFERROR(VLOOKUP(B7,Entries!$A:$E,5,0),\"-\")","v":"Harvey"},{"$f":"IFERROR(VLOOKUP(B7,Entries!$A:$D,4,0),\"-\")","v":"Conor"},{"$f":"IFERROR(VLOOKUP(B7,Entries!$A:$H,8,0),\"-\")","v":5},{"$f":"IFERROR(VLOOKUP(B7,Entries!$A:$F,6,0),\"-\")","v":"City of Southend On Sea AC"},10.54,null,3,322,{"$f":"IFERROR(VLOOKUP(J7,Entries!$A:$E,5,0),\"-\")","v":"Abrahams"},{"$f":"IFERROR(VLOOKUP(J7,Entries!$A:$D,4,0),\"-\")","v":"Sadie"},{"$f":"IFERROR(VLOOKUP(J7,Entries!$A:$H,8,0),\"-\")","v":5},{"$f":"IFERROR(VLOOKUP(J7,Entries!$A:$F,6,0),\"-\")","v":"City of Southend-on-Sea Athletic Club"},"NO TIME "]
[4,109,{"$f":"IFERROR(VLOOKUP(B8,Entries!$A:$E,5,0),\"-\")","v":"Silvain"},{"$f":"IFERROR(VLOOKUP(B8,Entries!$A:$D,4,0),\"-\")","v":"Toby"},{"$f":"IFERROR(VLOOKUP(B8,Entries!$A:$H,8,0),\"-\")","v":6},{"$f":"IFERROR(VLOOKUP(B8,Entries!$A:$F,6,0),\"-\")","v":"Unattached"},10.91,null,4,200,{"$f":"IFERROR(VLOOKUP(J8,Entries!$A:$E,5,0),\"-\")","v":"Clark-Abdullah"},{"$f":"IFERROR(VLOOKUP(J8,Entries!$A:$D,4,0),\"-\")","v":"Ophelia"},{"$f":"IFERROR(VLOOKUP(J8,Entries!$A:$H,8,0),\"-\")","v":5},{"$f":"IFERROR(VLOOKUP(J8,Entries!$A:$F,6,0),\"-\")","v":"City of Southend-on-Sea Athletic Club"},"NO TIME "]
[5,46,{"$f":"IFERROR(VLOOKUP(B9,Entries!$A:$E,5,0),\"-\")","v":"O'Kill"},{"$f":"IFERROR(VLOOKUP(B9,Entries!$A:$D,4,0),\"-\")","v":"Arthur"},{"$f":"IFERROR(VLOOKUP(B9,Entries!$A:$H,8,0),\"-\")","v":6},{"$f":"IFERROR(VLOOKUP(B9,Entries!$A:$F,6,0),\"-\")","v":"City of Southend On Sea AC"},11.67,null,5,47,{"$f":"IFERROR(VLOOKUP(J9,Entries!$A:$E,5,0),\"-\")","v":"O'Kill"},{"$f":"IFERROR(VLOOKUP(J9,Entries!$A:$D,4,0),\"-\")","v":"Scarlett"},{"$f":"IFERROR(VLOOKUP(J9,Entries!$A:$H,8,0),\"-\")","v":5},{"$f":"IFERROR(VLOOKUP(J9,Entries!$A:$F,6,0),\"-\")","v":"City of Southend On Sea AC"},"NO TIME "]
[6,21,{"$f":"IFERROR(VLOOKUP(B10,Entries!$A:$E,5,0),\"-\")","v":"Druce"},{"$f":"IFERROR(VLOOKUP(B10,Entries!$A:$D,4,0),\"-\")","v":"Reuben"},{"$f":"IFERROR(VLOOKUP(B10,Entries!$A:$H,8,0),\"-\")","v":5},{"$f":"IFERROR(VLOOKUP(B10,Entries!$A:$F,6,0),\"-\")","v":"City of Southend On Sea AC"},12.24,null,6,null,{"$f":"IFERROR(VLOOKUP(J10,Entries!$A:$E,5,0),\"-\")","v":"-"},{"$f":"IFERROR(VLOOKUP(J10,Entries!$A:$D,4,0),\"-\")","v":"-"},{"$f":"IFERROR(VLOOKUP(J10,Entries!$A:$H,8,0),\"-\")","v":"-"},{"$f":"IFERROR(VLOOKUP(J10,Entries!$A:$F,6,0),\"-\")","v":"-"}]
[7,71,{"$f":"IFERROR(VLOOKUP(B11,Entries!$A:$E,5,0),\"-\")","v":"Young"},{"$f":"IFERROR(VLOOKUP(B11,Entries!$A:$D,4,0),\"-\")","v":"Harvey"},{"$f":"IFERROR(VLOOKUP(B11,Entries!$A:$H,8,0),\"-\")","v":5},{"$f":"IFERROR(VLOOKUP(B11,Entries!$A:$F,6,0),\"-\")","v":"SS Athletics"},16.48,null,7,null,{"$f":"IFERROR(VLOOKUP(J11,Entries!$A:$E,5,0),\"-\")","v":"-"},{"$f":"IFERROR(VLOOKUP(J11,Entries!$A:$D,4,0),\"-\")","v":"-"},{"$f":"IFERROR(VLOOKUP(J11,Entries!$A:$H,8,0),\"-\")","v":"-"},{"$f":"IFERROR(VLOOKUP(J11,Entries!$A:$F,6,0),\"-\")","v":"-"}]
[8,null,{"$f":"IFERROR(VLOOKUP(B12,Entries!$A:$E,5,0),\"-\")","v":"-"},{"$f":"IFERROR(VLOOKUP(B12,Entries!$A:$D,4,0),\"-\")","v":"-"},{"$f":"IFERROR(VLOOKUP(B12,Entries!$A:$H,8,0),\"-\")","v":"-"},{"$f":"IFERROR(VLOOKUP(B12,Entries!$A:$F,6,0),\"-\")","v":"-"},null,null,8,null,{"$f":"IFERROR(VLOOKUP(J12,Entries!$A:$E,5,0),\"-\")","v":"-"},{"$f":"IFERROR(VLOOKUP(J12,Entries!$A:$D,4,0),\"-\")","v":"-"},{"$f":"IFERROR(VLOOKUP(J12,Entries!$A:$H,8,0),\"-\")","v":"-"},{"$f":"IFERROR(VLOOKUP(J12,Entries!$A:$F,6,0),\"-\")","v":"-"}]
[9,null,{"$f":"IFERROR(VLOOKUP(B13,Entries!$A:$E,5,0),\"-\")","v":"-"},{"$f":"IFERROR(VLOOKUP(B13,Entries!$A:$D,4,0),\"-\")","v":"-"},{"$f":"IFERROR(VLOOKUP(B13,Entries!$A:$H,8,0),\"-\")","v":"-"},{"$f":"IFERROR(VLOOKUP(B13,Entries!$A:$F,6,0),\"-\")","v":"-"},null,null,9,null,{"$f":"IFERROR(VLOOKUP(J13,Entries!$A:$E,5,0),\"-\")","v":"-"},{"$f":"IFERROR(VLOOKUP(J13,Entries!$A:$D,4,0),\"-\")","v":"-"},{"$f":"IFERROR(VLOOKUP(J13,Entries!$A:$H,8,0),\"-\")","v":"-"},{"$f":"IFERROR(VLOOKUP(J13,Entries!$A:$F,6,0),\"-\")","v":"-"}]
[10,null,{"$f":"IFERROR(VLOOKUP(B14,Entries!$A:$E,5,0),\"-\")","v":"-"},{"$f":"IFERROR(VLOOKUP(B14,Entries!$A:$D,4,0),\"-\")","v":"-"},{"$f":"IFERROR(VLOOKUP(B14,Entries!$A:$H,8,0),\"-\")","v":"-"},{"$f":"IFERROR(VLOOKUP(B14,Entries!$A:$F,6,0),\"-\")","v":"-"},null,null,10,null,{"$f":"IFERROR(VLOOKUP(J14,Entries!$A:$E,5,0),\"-\")","v":"-"},{"$f":"IFERROR(VLOOKUP(J14,Entries!$A:$D,4,0),\"-\")","v":"-"},{"$f":"IFERROR(VLOOKUP(J14,Entries!$A:$H,8,0),\"-\")","v":"-"},{"$f":"IFERROR(VLOOKUP(J14,Entries!$A:$F,6,0),\"-\")","v":"-"}]
[]
[]
["U9 Boys","Heat 2",null,null,null,"Wind",null,null,"U9 Girls",null,null,null,null,"Wind"]
["Pos","Number","Last Name","First Name","Age","Club","Time",null,"Pos","Number","Last Name","First Name","Age","Club","Time"]
[1,135,{"$f":"IFERROR(VLOOKUP(B19,Entries!$A:$E,5,0),\"-\")","v":"Hoyte"},{"$f":"IFERROR(VLOOKUP(B19,Entries!$A:$D,4,0),\"-\")","v":"Amari"},{"$f":"IFERROR(VLOOKUP(B19,Entries!$A:$H,8,0),\"-\")","v":6},{"$f":"IFERROR(VLOOKUP(B19,Entries!$A:$F,6,0),\"-\")","v":"Brentwood Beagles Athletics Club"},"9.87",null,1,32,{"$f":"IFERROR(VLOOKUP(J19,Entries!$A:$E,5,0),\"-\")","v":"Jones"},{"$f":"IFERROR(VLOOKUP(J19,Entries!$A:$D,4,0),\"-\")","v":"Zara"},{"$f":"IFERROR(VLOOKUP(J19,Entries!$A:$H,8,0),\"-\")","v":6},{"$f":"IFERROR(VLOOKUP(J19,Entries!$A:$F,6,0),\"-\")","v":"Young Athletes Club"},"10.48"]
[2,91,{"$f":"IFERROR(VLOOKUP(B20,Entries!$A:$E,5,0),\"-\")","v":"Richardson"},{"$f":"IFERROR(VLOOKUP(B20,Entries!$A:$D,4,0),\"-\")","v":"Alfie"},{"$f":"IFERROR(VLOOKUP(B20,Entries!$A:$H,8,0),\"-\")","v":6},{"$f":"IFERROR(VLOOKUP(B20,Entries!$A:$F,6,0),\"-\")","v":"SS Athletics"},"9.94",null,2,278,{"$f":"IFERROR(VLOOKUP(J20,Entries!$A:$E,5,0),\"-\")","v":"Care"},{"$f":"IFERROR(VLOOKUP(J20,Entries!$A:$D,4,0),\"-\")","v":"Poppy"},{"$f":"IFERROR(VLOOKUP(J20,Entries!$A:$H,8,0),\"-\")","v":6},{"$f":"IFERROR(VLOOKUP(J20,Entries!$A:$F,6,0),\"-\")","v":"SS Athletics"},"10.62"]
[3,228,{"$f":"IFERROR(VLOOKUP(B21,Entries!$A:$E,5,0),\"-\")","v":"Fraser-Johnson"},{"$f":"IFERROR(VLOOKUP(B21,Entries!$A:$D,4,0),\"-\")","v":"Tyson"},{"$f":"IFERROR(VLOOKUP(B21,Entries!$A:$H,8,0),\"-\")","v":6},{"$f":"IFERROR(VLOOKUP(B21,Entries!$A:$F,6,0),\"-\")","v":"City of Southend-on-Sea Athletic Club"},"10.69",null,3,30,{"$f":"IFERROR(VLOOKUP(J21,Entries!$A:$E,5,0),\"-\")","v":"Lon"},{"$f":"IFERROR(VLOOKUP(J21,Entries!$A:$D,4,0),\"-\")","v":"Imogen"},{"$f":"IFERROR(VLOOKUP(J21,Entries!$A:$H,8,0),\"-\")","v":6},{"$f":"IFERROR(VLOOKUP(J21,Entries!$A:$F,6,0),\"-\")","v":"Unattached"},"10.94"]
[4,122,{"$f":"IFERROR(VLOOKUP(B22,Entries!$A:$E,5,0),\"-\")","v":"Chittock"},{"$f":"IFERROR(VLOOKUP(B22,Entries!$A:$D,4,0),\"-\")","v":"Harry"},{"$f":"IFERROR(VLOOKUP(B22,Entries!$A:$H,8,0),\"-\")","v":6},{"$f":"IFERROR(VLOOKUP(B22,Entries!$A:$F,6,0),\"-\")","v":"City of Southend On Sea AC"},"10.81",null,4,110,{"$f":"IFERROR(VLOOKUP(J22,Entries!$A:$E,5,0),\"-\")","v":"William"},{"$f":"IFERROR(VLOOKUP(J22,Entries!$A:$D,4,0),\"-\")","v":"Isabella"},{"$f":"IFERROR(VLOOKUP(J22,Entries!$A:$H,8,0),\"-\")","v":6},{"$f":"IFERROR(VLOOKUP(J22,Entries!$A:$F,6,0),\"-\")","v":"City of Southend On Sea AC"},"11.22"]
[5,351,{"$f":"IFERROR(VLOOKUP(B23,Entries!$A:$E,5,0),\"-\")","v":"Brazier"},{"$f":"IFERROR(VLOOKUP(B23,Entries!$A:$D,4,0),\"-\")","v":"Ben"},{"$f":"IFERROR(VLOOKUP(B23,Entries!$A:$H,8,0),\"-\")","v":6},{"$f":"IFERROR(VLOOKUP(B23,Entries!$A:$F,6,0),\"-\")","v":"SS Athletics"},"11.77",null,5,274,{"$f":"IFERROR(VLOOKUP(J23,Entries!$A:$E,5,0),\"-\")","v":"Mathe"},{"$f":"IFERROR(VLOOKUP(J23,Entries!$A:$D,4,0),\"-\")","v":"Ayana"},{"$f":"IFERROR(VLOOKUP(J23,Entries!$A:$H,8,0),\"-\")","v":6},{"$f":"IFERROR(VLOOKUP(J23,Entries!$A:$F,6,0),\"-\")","v":"Unattached"},"11.90"]
[6,259,{"$f":"IFERROR(VLOOKUP(B24,Entries!$A:$E,5,0),\"-\")","v":"Murali"},{"$f":"IFERROR(VLOOKUP(B24,Entries!$A:$D,4,0),\"-\")","v":"Adithan"},{"$f":"IFERROR(VLOOKUP(B24,Entries!$A:$H,8,0),\"-\")","v":6},{"$f":"IFERROR(VLOOKUP(B24,Entries!$A:$F,6,0),\"-\")","v":"City of Southend On Sea AC"},"11.84",null,6,null,{"$f":"IFERROR(VLOOKUP(J24,Entries!$A:$E,5,0),\"-\")","v":"-"},{"$f":"IFERROR(VLOOKUP(J24,Entries!$A:$D,4,0),\"-\")","v":"-"},{"$f":"IFERROR(VLOOKUP(J24,Entries!$A:$H,8,0),\"-\")","v":"-"},{"$f":"IFERROR(VLOOKUP(J24,Entries!$A:$F,6,0),\"-\")","v":"-"}]
[7,null,{"$f":"IFERROR(VLOOKUP(B25,Entries!$A:$E,5,0),\"-\")","v":"-"},{"$f":"IFERROR(VLOOKUP(B25,Entries!$A:$D,4,0),\"-\")","v":"-"},{"$f":"IFERROR(VLOOKUP(B25,Entries!$A:$H,8,0),\"-\")","v":"-"},{"$f":"IFERROR(VLOOKUP(B25,Entries!$A:$F,6,0),\"-\")","v":"-"}," ",null,7,null,{"$f":"IFERROR(VLOOKUP(J25,Entries!$A:$E,5,0),\"-\")","v":"-"},{"$f":"IFERROR(VLOOKUP(J25,Entries!$A:$D,4,0),\"-\")","v":"-"},{"$f":"IFERROR(VLOOKUP(J25,Entries!$A:$H,8,0),\"-\")","v":"-"},{"$f":"IFERROR(VLOOKUP(J25,Entries!$A:$F,6,0),\"-\")","v":"-"}]
[8,null,{"$f":"IFERROR(VLOOKUP(B26,Entries!$A:$E,5,0),\"-\")","v":"-"},{"$f":"IFERROR(VLOOKUP(B26,Entries!$A:$D,4,0),\"-\")","v":"-"},{"$f":"IFERROR(VLOOKUP(B26,Entries!$A:$H,8,0),\"-\")","v":"-"},{"$f":"IFERROR(VLOOKUP(B26,Entries!$A:$F,6,0),\"-\")","v":"-"},null,null,8,null,{"$f":"IFERROR(VLOOKUP(J26,Entries!$A:$E,5,0),\"-\")","v":"-"},{"$f":"IFERROR(VLOOKUP(J26,Entries!$A:$D,4,0),\"-\")","v":"-"},{"$f":"IFERROR(VLOOKUP(J26,Entries!$A:$H,8,0),\"-\")","v":"-"},{"$f":"IFERROR(VLOOKUP(J26,Entries!$A:$F,6,0),\"-\")","v":"-"}]
[9,null,{"$f":"IFERROR(VLOOKUP(B27,Entries!$A:$E,5,0),\"-\")","v":"-"},{"$f":"IFERROR(VLOOKUP(B27,Entries!$A:$D,4,0),\"-\")","v":"-"},{"$f":"IFERROR(VLOOKUP(B27,Entries!$A:$H,8,0),\"-\")","v":"-"},{"$f":"IFERROR(VLOOKUP(B27,Entries!$A:$F,6,0),\"-\")","v":"-"},null,null,9,null,{"$f":"IFERROR(VLOOKUP(J27,Entries!$A:$E,5,0),\"-\")","v":"-"},{"$f":"IFERROR(VLOOKUP(J27,Entries!$A:$D,4,0),\"-\")","v":"-"},{"$f":"IFERROR(VLOOKUP(J27,Entries!$A:$H,8,0),\"-\")","v":"-"},{"$f":"IFERROR(VLOOKUP(J27,Entries!$A:$F,6,0),\"-\")","v":"-"}]
[10,null,{"$f":"IFERROR(VLOOKUP(B28,Entries!$A:$E,5,0),\"-\")","v":"-"},{"$f":"IFERROR(VLOOKUP(B28,Entries!$A:$D,4,0),\"-\")","v":"-"},{"$f":"IFERROR(VLOOKUP(B28,Entries!$A:$H,8,0),\"-\")","v":"-"},{"$f":"IFERROR(VLOOKUP(B28,Entries!$A:$F,6,0),\"-\")","v":"-"},null,null,10,null,{"$f":"IFERROR(VLOOKUP(J28,Entries!$A:$E,5,0),\"-\")","v":"-"},{"$f":"IFERROR(VLOOKUP(J28,Entries!$A:$D,4,0),\"-\")","v":"-"},{"$f":"IFERROR(VLOOKUP(J28,Entries!$A:$H,8,0),\"-\")","v":"-"},{"$f":"IFERROR(VLOOKUP(J28,Entries!$A:$F,6,0),\"-\")","v":"-"}]

{"sheet":"60m","index":3,"n_rows":28,"n_cols":15,"rows_kept":28,"cut":false,"hidden":false,"merged":[]}
["60m","U11 Year 1 and 2"]
[]
["U11 Boys",null,null,null,null,"Wind",null,null,"U11 Girls",null,null,null,null,"Wind"]
["Pos","Number","Last Name","First Name","Age","Club","Time",null,"Pos","Number","Last Name","First Name","Age","Club","Time"]
[1,68,{"$f":"IFERROR(VLOOKUP(B5,Entries!$A:$E,5,0),\"-\")","v":"Adenodi"},{"$f":"IFERROR(VLOOKUP(B5,Entries!$A:$D,4,0),\"-\")","v":"Ethan"},{"$f":"IFERROR(VLOOKUP(B5,Entries!$A:$H,8,0),\"-\")","v":8},{"$f":"IFERROR(VLOOKUP(B5,Entries!$A:$F,6,0),\"-\")","v":"SS Athletics"},"10.94",null,1,83,{"$f":"IFERROR(VLOOKUP(J5,Entries!$A:$E,5,0),\"-\")","v":"Wenn"},{"$f":"IFERROR(VLOOKUP(J5,Entries!$A:$D,4,0),\"-\")","v":"Olivia"},{"$f":"IFERROR(VLOOKUP(J5,Entries!$A:$H,8,0),\"-\")","v":7},{"$f":"IFERROR(VLOOKUP(J5,Entries!$A:$F,6,0),\"-\")","v":"SS Athletics"},"12.09"]
[2,313,{"$f":"IFERROR(VLOOKUP(B6,Entries!$A:$E,5,0),\"-\")","v":"Vaughan"},{"$f":"IFERROR(VLOOKUP(B6,Entries!$A:$D,4,0),\"-\")","v":"Brody"},{"$f":"IFERROR(VLOOKUP(B6,Entries!$A:$H,8,0),\"-\")","v":7},{"$f":"IFERROR(VLOOKUP(B6,Entries!$A:$F,6,0),\"-\")","v":"SS Athletics"},"11.21",null,2,336,{"$f":"IFERROR(VLOOKUP(J6,Entries!$A:$E,5,0),\"-\")","v":"Smith"},{"$f":"IFERROR(VLOOKUP(J6,Entries!$A:$D,4,0),\"-\")","v":"Willow"},{"$f":"IFERROR(VLOOKUP(J6,Entries!$A:$H,8,0),\"-\")","v":7},{"$f":"IFERROR(VLOOKUP(J6,Entries!$A:$F,6,0),\"-\")","v":"Brentwood Beagles Athletics Club"},"12.30"]
[3,174,{"$f":"IFERROR(VLOOKUP(B7,Entries!$A:$E,5,0),\"-\")","v":"Patel"},{"$f":"IFERROR(VLOOKUP(B7,Entries!$A:$D,4,0),\"-\")","v":"Krish Leo Jay"},{"$f":"IFERROR(VLOOKUP(B7,Entries!$A:$H,8,0),\"-\")","v":7},{"$f":"IFERROR(VLOOKUP(B7,Entries!$A:$F,6,0),\"-\")","v":"Brentwood Beagles Athletics Club"},"11.35",null,3,224,{"$f":"IFERROR(VLOOKUP(J7,Entries!$A:$E,5,0),\"-\")","v":"Emery"},{"$f":"IFERROR(VLOOKUP(J7,Entries!$A:$D,4,0),\"-\")","v":"Eden"},{"$f":"IFERROR(VLOOKUP(J7,Entries!$A:$H,8,0),\"-\")","v":7},{"$f":"IFERROR(VLOOKUP(J7,Entries!$A:$F,6,0),\"-\")","v":"Unattached"},"13.18"]
[4,167,{"$f":"IFERROR(VLOOKUP(B8,Entries!$A:$E,5,0),\"-\")","v":"Njogu"},{"$f":"IFERROR(VLOOKUP(B8,Entries!$A:$D,4,0),\"-\")","v":"Geoffrey"},{"$f":"IFERROR(VLOOKUP(B8,Entries!$A:$H,8,0),\"-\")","v":7},{"$f":"IFERROR(VLOOKUP(B8,Entries!$A:$F,6,0),\"-\")","v":"Unattached"},"12.00",null,4,102,{"$f":"IFERROR(VLOOKUP(J8,Entries!$A:$E,5,0),\"-\")","v":"Hallahan"},{"$f":"IFERROR(VLOOKUP(J8,Entries!$A:$D,4,0),\"-\")","v":"Nainsi"},{"$f":"IFERROR(VLOOKUP(J8,Entries!$A:$H,8,0),\"-\")","v":7},{"$f":"IFERROR(VLOOKUP(J8,Entries!$A:$F,6,0),\"-\")","v":"Unattached"},"13.45"]
[5,245,{"$f":"IFERROR(VLOOKUP(B9,Entries!$A:$E,5,0),\"-\")","v":"Nedkov"},{"$f":"IFERROR(VLOOKUP(B9,Entries!$A:$D,4,0),\"-\")","v":"Robbie"},{"$f":"IFERROR(VLOOKUP(B9,Entries!$A:$H,8,0),\"-\")","v":7},{"$f":"IFERROR(VLOOKUP(B9,Entries!$A:$F,6,0),\"-\")","v":"Unattached"},"12.08",null,5,221,{"$f":"IFERROR(VLOOKUP(J9,Entries!$A:$E,5,0),\"-\")","v":"Grimes"},{"$f":"IFERROR(VLOOKUP(J9,Entries!$A:$D,4,0),\"-\")","v":"Penelope"},{"$f":"IFERROR(VLOOKUP(J9,Entries!$A:$H,8,0),\"-\")","v":7},{"$f":"IFERROR(VLOOKUP(J9,Entries!$A:$F,6,0),\"-\")","v":"SS Athletics"},"13.62"]
[6,237,{"$f":"IFERROR(VLOOKUP(B10,Entries!$A:$E,5,0),\"-\")","v":"Neary"},{"$f":"IFERROR(VLOOKUP(B10,Entries!$A:$D,4,0),\"-\")","v":"Woody"},{"$f":"IFERROR(VLOOKUP(B10,Entries!$A:$H,8,0),\"-\")","v":7},{"$f":"IFERROR(VLOOKUP(B10,Entries!$A:$F,6,0),\"-\")","v":"SS Athletics"},"12.62",null,6,199,{"$f":"IFERROR(VLOOKUP(J10,Entries!$A:$E,5,0),\"-\")","v":"Clark-Abdullah"},{"$f":"IFERROR(VLOOKUP(J10,Entries!$A:$D,4,0),\"-\")","v":"Vivienne"},{"$f":"IFERROR(VLOOKUP(J10,Entries!$A:$H,8,0),\"-\")","v":7},{"$f":"IFERROR(VLOOKUP(J10,Entries!$A:$F,6,0),\"-\")","v":"City of Southend-on-Sea Athletic Club"},"14.00"]
[7,null,{"$f":"IFERROR(VLOOKUP(B11,Entries!$A:$E,5,0),\"-\")","v":"-"},{"$f":"IFERROR(VLOOKUP(B11,Entries!$A:$D,4,0),\"-\")","v":"-"},{"$f":"IFERROR(VLOOKUP(B11,Entries!$A:$H,8,0),\"-\")","v":"-"},{"$f":"IFERROR(VLOOKUP(B11,Entries!$A:$F,6,0),\"-\")","v":"-"},null,null,7,null,{"$f":"IFERROR(VLOOKUP(J11,Entries!$A:$E,5,0),\"-\")","v":"-"},{"$f":"IFERROR(VLOOKUP(J11,Entries!$A:$D,4,0),\"-\")","v":"-"},{"$f":"IFERROR(VLOOKUP(J11,Entries!$A:$H,8,0),\"-\")","v":"-"},{"$f":"IFERROR(VLOOKUP(J11,Entries!$A:$F,6,0),\"-\")","v":"-"}]
[8,null,{"$f":"IFERROR(VLOOKUP(B12,Entries!$A:$E,5,0),\"-\")","v":"-"},{"$f":"IFERROR(VLOOKUP(B12,Entries!$A:$D,4,0),\"-\")","v":"-"},{"$f":"IFERROR(VLOOKUP(B12,Entries!$A:$H,8,0),\"-\")","v":"-"},{"$f":"IFERROR(VLOOKUP(B12,Entries!$A:$F,6,0),\"-\")","v":"-"},null,null,8,null,{"$f":"IFERROR(VLOOKUP(J12,Entries!$A:$E,5,0),\"-\")","v":"-"},{"$f":"IFERROR(VLOOKUP(J12,Entries!$A:$D,4,0),\"-\")","v":"-"},{"$f":"IFERROR(VLOOKUP(J12,Entries!$A:$H,8,0),\"-\")","v":"-"},{"$f":"IFERROR(VLOOKUP(J12,Entries!$A:$F,6,0),\"-\")","v":"-"}]
[9,null,{"$f":"IFERROR(VLOOKUP(B13,Entries!$A:$E,5,0),\"-\")","v":"-"},{"$f":"IFERROR(VLOOKUP(B13,Entries!$A:$D,4,0),\"-\")","v":"-"},{"$f":"IFERROR(VLOOKUP(B13,Entries!$A:$H,8,0),\"-\")","v":"-"},{"$f":"IFERROR(VLOOKUP(B13,Entries!$A:$F,6,0),\"-\")","v":"-"},null,null,9,null,{"$f":"IFERROR(VLOOKUP(J13,Entries!$A:$E,5,0),\"-\")","v":"-"},{"$f":"IFERROR(VLOOKUP(J13,Entries!$A:$D,4,0),\"-\")","v":"-"},{"$f":"IFERROR(VLOOKUP(J13,Entries!$A:$H,8,0),\"-\")","v":"-"},{"$f":"IFERROR(VLOOKUP(J13,Entries!$A:$F,6,0),\"-\")","v":"-"}]
[10,null,{"$f":"IFERROR(VLOOKUP(B14,Entries!$A:$E,5,0),\"-\")","v":"-"},{"$f":"IFERROR(VLOOKUP(B14,Entries!$A:$D,4,0),\"-\")","v":"-"},{"$f":"IFERROR(VLOOKUP(B14,Entries!$A:$H,8,0),\"-\")","v":"-"},{"$f":"IFERROR(VLOOKUP(B14,Entries!$A:$F,6,0),\"-\")","v":"-"},null,null,10,null,{"$f":"IFERROR(VLOOKUP(J14,Entries!$A:$E,5,0),\"-\")","v":"-"},{"$f":"IFERROR(VLOOKUP(J14,Entries!$A:$D,4,0),\"-\")","v":"-"},{"$f":"IFERROR(VLOOKUP(J14,Entries!$A:$H,8,0),\"-\")","v":"-"},{"$f":"IFERROR(VLOOKUP(J14,Entries!$A:$F,6,0),\"-\")","v":"-"}]
[]
[]
["U11 Boys",null,null,null,null,"Wind",-4.5,null,"U11 Girls",null,null,null,null,"Wind"]
["Pos","Number","Last Name","First Name","Age","Club","Time",null,"Pos","Number","Last Name","First Name","Age","Club","Time"]
[1,33,{"$f":"IFERROR(VLOOKUP(B19,Entries!$A:$E,5,0),\"-\")","v":"Boygle"},{"$f":"IFERROR(VLOOKUP(B19,Entries!$A:$D,4,0),\"-\")","v":"Ethan"},{"$f":"IFERROR(VLOOKUP(B19,Entries!$A:$H,8,0),\"-\")","v":8},{"$f":"IFERROR(VLOOKUP(B19,Entries!$A:$F,6,0),\"-\")","v":"Unattached"},"10.21",null,1,156,{"$f":"IFERROR(VLOOKUP(J19,Entries!$A:$E,5,0),\"-\")","v":"Rayner"},{"$f":"IFERROR(VLOOKUP(J19,Entries!$A:$D,4,0),\"-\")","v":"Frankie"},{"$f":"IFERROR(VLOOKUP(J19,Entries!$A:$H,8,0),\"-\")","v":8},{"$f":"IFERROR(VLOOKUP(J19,Entries!$A:$F,6,0),\"-\")","v":"Herts Phoenix AC"},"10.21"]
[2,242,{"$f":"IFERROR(VLOOKUP(B20,Entries!$A:$E,5,0),\"-\")","v":"Khan"},{"$f":"IFERROR(VLOOKUP(B20,Entries!$A:$D,4,0),\"-\")","v":"Muhammad "},{"$f":"IFERROR(VLOOKUP(B20,Entries!$A:$H,8,0),\"-\")","v":8},{"$f":"IFERROR(VLOOKUP(B20,Entries!$A:$F,6,0),\"-\")","v":"City of Southend On Sea AC"},"10.72",null,2,7,{"$f":"IFERROR(VLOOKUP(J20,Entries!$A:$E,5,0),\"-\")","v":"Ngala"},{"$f":"IFERROR(VLOOKUP(J20,Entries!$A:$D,4,0),\"-\")","v":"Mya"},{"$f":"IFERROR(VLOOKUP(J20,Entries!$A:$H,8,0),\"-\")","v":7},{"$f":"IFERROR(VLOOKUP(J20,Entries!$A:$F,6,0),\"-\")","v":"Brentwood Beagles Athletics Club"},"10.48"]
[3,277,{"$f":"IFERROR(VLOOKUP(B21,Entries!$A:$E,5,0),\"-\")","v":"Care"},{"$f":"IFERROR(VLOOKUP(B21,Entries!$A:$D,4,0),\"-\")","v":"George"},{"$f":"IFERROR(VLOOKUP(B21,Entries!$A:$H,8,0),\"-\")","v":8},{"$f":"IFERROR(VLOOKUP(B21,Entries!$A:$F,6,0),\"-\")","v":"SS Athletics"},"10.85",null,3,185,{"$f":"IFERROR(VLOOKUP(J21,Entries!$A:$E,5,0),\"-\")","v":"Dixon"},{"$f":"IFERROR(VLOOKUP(J21,Entries!$A:$D,4,0),\"-\")","v":"Everly"},{"$f":"IFERROR(VLOOKUP(J21,Entries!$A:$H,8,0),\"-\")","v":8},{"$f":"IFERROR(VLOOKUP(J21,Entries!$A:$F,6,0),\"-\")","v":"SS Athletics"},"10.70"]
[4,206,{"$f":"IFERROR(VLOOKUP(B22,Entries!$A:$E,5,0),\"-\")","v":"Glenn-James"},{"$f":"IFERROR(VLOOKUP(B22,Entries!$A:$D,4,0),\"-\")","v":"Theo"},{"$f":"IFERROR(VLOOKUP(B22,Entries!$A:$H,8,0),\"-\")","v":8},{"$f":"IFERROR(VLOOKUP(B22,Entries!$A:$F,6,0),\"-\")","v":"City of Southend-on-Sea Athletic Club"},"10.87",null,4,363,{"$f":"IFERROR(VLOOKUP(J22,Entries!$A:$E,5,0),\"-\")","v":"Gosling"},{"$f":"IFERROR(VLOOKUP(J22,Entries!$A:$D,4,0),\"-\")","v":"Elise"},{"$f":"IFERROR(VLOOKUP(J22,Entries!$A:$H,8,0),\"-\")","v":8},{"$f":"IFERROR(VLOOKUP(J22,Entries!$A:$F,6,0),\"-\")","v":"Brentwood Beagles Athletics Club"},"10.70"]
[5,267,{"$f":"IFERROR(VLOOKUP(B23,Entries!$A:$E,5,0),\"-\")","v":"Tubman"},{"$f":"IFERROR(VLOOKUP(B23,Entries!$A:$D,4,0),\"-\")","v":"Tristan"},{"$f":"IFERROR(VLOOKUP(B23,Entries!$A:$H,8,0),\"-\")","v":8},{"$f":"IFERROR(VLOOKUP(B23,Entries!$A:$F,6,0),\"-\")","v":"City of Southend On Sea AC"},"11.54",null,5,69,{"$f":"IFERROR(VLOOKUP(J23,Entries!$A:$E,5,0),\"-\")","v":"Adenodi"},{"$f":"IFERROR(VLOOKUP(J23,Entries!$A:$D,4,0),\"-\")","v":"Esther"},{"$f":"IFERROR(VLOOKUP(J23,Entries!$A:$H,8,0),\"-\")","v":8},{"$f":"IFERROR(VLOOKUP(J23,Entries!$A:$F,6,0),\"-\")","v":"SS Athletics"},"10.93"]
[6,null,{"$f":"IFERROR(VLOOKUP(B24,Entries!$A:$E,5,0),\"-\")","v":"-"},{"$f":"IFERROR(VLOOKUP(B24,Entries!$A:$D,4,0),\"-\")","v":"-"},{"$f":"IFERROR(VLOOKUP(B24,Entries!$A:$H,8,0),\"-\")","v":"-"},{"$f":"IFERROR(VLOOKUP(B24,Entries!$A:$F,6,0),\"-\")","v":"-"},null,null,6,50,{"$f":"IFERROR(VLOOKUP(J24,Entries!$A:$E,5,0),\"-\")","v":"Nti-Jackson"},{"$f":"IFERROR(VLOOKUP(J24,Entries!$A:$D,4,0),\"-\")","v":"Serena"},{"$f":"IFERROR(VLOOKUP(J24,Entries!$A:$H,8,0),\"-\")","v":7},{"$f":"IFERROR(VLOOKUP(J24,Entries!$A:$F,6,0),\"-\")","v":"SS Athletics"},"11.06"]
[7,null,{"$f":"IFERROR(VLOOKUP(B25,Entries!$A:$E,5,0),\"-\")","v":"-"},{"$f":"IFERROR(VLOOKUP(B25,Entries!$A:$D,4,0),\"-\")","v":"-"},{"$f":"IFERROR(VLOOKUP(B25,Entries!$A:$H,8,0),\"-\")","v":"-"},{"$f":"IFERROR(VLOOKUP(B25,Entries!$A:$F,6,0),\"-\")","v":"-"},null,null,7,null,{"$f":"IFERROR(VLOOKUP(J25,Entries!$A:$E,5,0),\"-\")","v":"-"},{"$f":"IFERROR(VLOOKUP(J25,Entries!$A:$D,4,0),\"-\")","v":"-"},{"$f":"IFERROR(VLOOKUP(J25,Entries!$A:$H,8,0),\"-\")","v":"-"},{"$f":"IFERROR(VLOOKUP(J25,Entries!$A:$F,6,0),\"-\")","v":"-"}]
[8,null,{"$f":"IFERROR(VLOOKUP(B26,Entries!$A:$E,5,0),\"-\")","v":"-"},{"$f":"IFERROR(VLOOKUP(B26,Entries!$A:$D,4,0),\"-\")","v":"-"},{"$f":"IFERROR(VLOOKUP(B26,Entries!$A:$H,8,0),\"-\")","v":"-"},{"$f":"IFERROR(VLOOKUP(B26,Entries!$A:$F,6,0),\"-\")","v":"-"},null,null,8,null,{"$f":"IFERROR(VLOOKUP(J26,Entries!$A:$E,5,0),\"-\")","v":"-"},{"$f":"IFERROR(VLOOKUP(J26,Entries!$A:$D,4,0),\"-\")","v":"-"},{"$f":"IFERROR(VLOOKUP(J26,Entries!$A:$H,8,0),\"-\")","v":"-"},{"$f":"IFERROR(VLOOKUP(J26,Entries!$A:$F,6,0),\"-\")","v":"-"}]
[9,null,{"$f":"IFERROR(VLOOKUP(B27,Entries!$A:$E,5,0),\"-\")","v":"-"},{"$f":"IFERROR(VLOOKUP(B27,Entries!$A:$D,4,0),\"-\")","v":"-"},{"$f":"IFERROR(VLOOKUP(B27,Entries!$A:$H,8,0),\"-\")","v":"-"},{"$f":"IFERROR(VLOOKUP(B27,Entries!$A:$F,6,0),\"-\")","v":"-"},null,null,9,null,{"$f":"IFERROR(VLOOKUP(J27,Entries!$A:$E,5,0),\"-\")","v":"-"},{"$f":"IFERROR(VLOOKUP(J27,Entries!$A:$D,4,0),\"-\")","v":"-"},{"$f":"IFERROR(VLOOKUP(J27,Entries!$A:$H,8,0),\"-\")","v":"-"},{"$f":"IFERROR(VLOOKUP(J27,Entries!$A:$F,6,0),\"-\")","v":"-"}]
[10,null,{"$f":"IFERROR(VLOOKUP(B28,Entries!$A:$E,5,0),\"-\")","v":"-"},{"$f":"IFERROR(VLOOKUP(B28,Entries!$A:$D,4,0),\"-\")","v":"-"},{"$f":"IFERROR(VLOOKUP(B28,Entries!$A:$H,8,0),\"-\")","v":"-"},{"$f":"IFERROR(VLOOKUP(B28,Entries!$A:$F,6,0),\"-\")","v":"-"},null,null,10,null,{"$f":"IFERROR(VLOOKUP(J28,Entries!$A:$E,5,0),\"-\")","v":"-"},{"$f":"IFERROR(VLOOKUP(J28,Entries!$A:$D,4,0),\"-\")","v":"-"},{"$f":"IFERROR(VLOOKUP(J28,Entries!$A:$H,8,0),\"-\")","v":"-"},{"$f":"IFERROR(VLOOKUP(J28,Entries!$A:$F,6,0),\"-\")","v":"-"}]

{"sheet":"75m","index":4,"n_rows":48,"n_cols":16,"rows_kept":48,"cut":false,"hidden":false,"merged":[]}
["75m","U11 Year 3,4 & 5"]
[]
["U11 Boys Heat 1",null,null,null,null,"Wind",-4.5999999999999996,null,null,"U11 Girls Heat 1",null,null,null,null,"Wind"]
["Pos","Number","Last Name","First Name","Age","Club","Time",null,null,"Pos","Number","Last Name","First Name","Age","Club","Time"]
[1,304,{"$f":"IFERROR(VLOOKUP(B5,Entries!$A:$E,5,0),\"-\")","v":"Cole"},{"$f":"IFERROR(VLOOKUP(B5,Entries!$A:$D,4,0),\"-\")","v":"Tyatt"},{"$f":"IFERROR(VLOOKUP(B5,Entries!$A:$H,8,0),\"-\")","v":9},{"$f":"IFERROR(VLOOKUP(B5,Entries!$A:$F,6,0),\"-\")","v":"City of Southend On Sea AC"},"12.24",null,null,1,134,{"$f":"IFERROR(VLOOKUP(K5,Entries!$A:$E,5,0),\"-\")","v":"Perry"},{"$f":"IFERROR(VLOOKUP(K5,Entries!$A:$D,4,0),\"-\")","v":"Elsie"},{"$f":"IFERROR(VLOOKUP(K5,Entries!$A:$H,8,0),\"-\")","v":9},{"$f":"IFERROR(VLOOKUP(K5,Entries!$A:$F,6,0),\"-\")","v":"SS Athletics"},"13.04"]
[2,292,{"$f":"IFERROR(VLOOKUP(B6,Entries!$A:$E,5,0),\"-\")","v":"Smith"},{"$f":"IFERROR(VLOOKUP(B6,Entries!$A:$D,4,0),\"-\")","v":"Alex"},{"$f":"IFERROR(VLOOKUP(B6,Entries!$A:$H,8,0),\"-\")","v":9},{"$f":"IFERROR(VLOOKUP(B6,Entries!$A:$F,6,0),\"-\")","v":"Brentwood Beagles Athletics Club"},"12.49",null,null,2,111,{"$f":"IFERROR(VLOOKUP(K6,Entries!$A:$E,5,0),\"-\")","v":"Brook"},{"$f":"IFERROR(VLOOKUP(K6,Entries!$A:$D,4,0),\"-\")","v":"Edith"},{"$f":"IFERROR(VLOOKUP(K6,Entries!$A:$H,8,0),\"-\")","v":9},{"$f":"IFERROR(VLOOKUP(K6,Entries!$A:$F,6,0),\"-\")","v":"SS Athletics"},"13.07"]
[3,314,{"$f":"IFERROR(VLOOKUP(B7,Entries!$A:$E,5,0),\"-\")","v":"Jackson"},{"$f":"IFERROR(VLOOKUP(B7,Entries!$A:$D,4,0),\"-\")","v":"Joshua"},{"$f":"IFERROR(VLOOKUP(B7,Entries!$A:$H,8,0),\"-\")","v":9},{"$f":"IFERROR(VLOOKUP(B7,Entries!$A:$F,6,0),\"-\")","v":"City of Southend-on-Sea Athletic Club"},"12.87",null,null,3,75,{"$f":"IFERROR(VLOOKUP(K7,Entries!$A:$E,5,0),\"-\")","v":"Webb"},{"$f":"IFERROR(VLOOKUP(K7,Entries!$A:$D,4,0),\"-\")","v":"Beatrice"},{"$f":"IFERROR(VLOOKUP(K7,Entries!$A:$H,8,0),\"-\")","v":9},{"$f":"IFERROR(VLOOKUP(K7,Entries!$A:$F,6,0),\"-\")","v":"SS Athletics"},"13.44"]
[4,307,{"$f":"IFERROR(VLOOKUP(B8,Entries!$A:$E,5,0),\"-\")","v":"Balisson"},{"$f":"IFERROR(VLOOKUP(B8,Entries!$A:$D,4,0),\"-\")","v":"Nathan"},{"$f":"IFERROR(VLOOKUP(B8,Entries!$A:$H,8,0),\"-\")","v":9},{"$f":"IFERROR(VLOOKUP(B8,Entries!$A:$F,6,0),\"-\")","v":"City of Southend On Sea AC"},"13.40",null,null,4,166,{"$f":"IFERROR(VLOOKUP(K8,Entries!$A:$E,5,0),\"-\")","v":"Njogu"},{"$f":"IFERROR(VLOOKUP(K8,Entries!$A:$D,4,0),\"-\")","v":"Keziah"},{"$f":"IFERROR(VLOOKUP(K8,Entries!$A:$H,8,0),\"-\")","v":9},{"$f":"IFERROR(VLOOKUP(K8,Entries!$A:$F,6,0),\"-\")","v":"SS Athletics"},"13.77"]
[5,null,{"$f":"IFERROR(VLOOKUP(B9,Entries!$A:$E,5,0),\"-\")","v":"-"},{"$f":"IFERROR(VLOOKUP(B9,Entries!$A:$D,4,0),\"-\")","v":"-"},{"$f":"IFERROR(VLOOKUP(B9,Entries!$A:$H,8,0),\"-\")","v":"-"},{"$f":"IFERROR(VLOOKUP(B9,Entries!$A:$F,6,0),\"-\")","v":"-"},null,null,null,5,81,{"$f":"IFERROR(VLOOKUP(K9,Entries!$A:$E,5,0),\"-\")","v":"Abdelruhman"},{"$f":"IFERROR(VLOOKUP(K9,Entries!$A:$D,4,0),\"-\")","v":"Hannah"},{"$f":"IFERROR(VLOOKUP(K9,Entries!$A:$H,8,0),\"-\")","v":9},{"$f":"IFERROR(VLOOKUP(K9,Entries!$A:$F,6,0),\"-\")","v":"SS Athletics"},"14.77"]
[6,null,{"$f":"IFERROR(VLOOKUP(B10,Entries!$A:$E,5,0),\"-\")","v":"-"},{"$f":"IFERROR(VLOOKUP(B10,Entries!$A:$D,4,0),\"-\")","v":"-"},{"$f":"IFERROR(VLOOKUP(B10,Entries!$A:$H,8,0),\"-\")","v":"-"},{"$f":"IFERROR(VLOOKUP(B10,Entries!$A:$F,6,0),\"-\")","v":"-"},null,null,null,6,74,{"$f":"IFERROR(VLOOKUP(K10,Entries!$A:$E,5,0),\"-\")","v":"Canter"},{"$f":"IFERROR(VLOOKUP(K10,Entries!$A:$D,4,0),\"-\")","v":"Esme-Ann"},{"$f":"IFERROR(VLOOKUP(K10,Entries!$A:$H,8,0),\"-\")","v":9},{"$f":"IFERROR(VLOOKUP(K10,Entries!$A:$F,6,0),\"-\")","v":"SS Athletics"},"14.79"]
[7,null,{"$f":"IFERROR(VLOOKUP(B11,Entries!$A:$E,5,0),\"-\")","v":"-"},{"$f":"IFERROR(VLOOKUP(B11,Entries!$A:$D,4,0),\"-\")","v":"-"},{"$f":"IFERROR(VLOOKUP(B11,Entries!$A:$H,8,0),\"-\")","v":"-"},{"$f":"IFERROR(VLOOKUP(B11,Entries!$A:$F,6,0),\"-\")","v":"-"},null,null,null,7,2,{"$f":"IFERROR(VLOOKUP(K11,Entries!$A:$E,5,0),\"-\")","v":"Awoyode"},{"$f":"IFERROR(VLOOKUP(K11,Entries!$A:$D,4,0),\"-\")","v":"Grace"},{"$f":"IFERROR(VLOOKUP(K11,Entries!$A:$H,8,0),\"-\")","v":9},{"$f":"IFERROR(VLOOKUP(K11,Entries!$A:$F,6,0),\"-\")","v":"Unattached"},"16.30"]
[8,null,{"$f":"IFERROR(VLOOKUP(B12,Entries!$A:$E,5,0),\"-\")","v":"-"},{"$f":"IFERROR(VLOOKUP(B12,Entries!$A:$D,4,0),\"-\")","v":"-"},{"$f":"IFERROR(VLOOKUP(B12,Entries!$A:$H,8,0),\"-\")","v":"-"},{"$f":"IFERROR(VLOOKUP(B12,Entries!$A:$F,6,0),\"-\")","v":"-"},null,null,null,8,null,{"$f":"IFERROR(VLOOKUP(K12,Entries!$A:$E,5,0),\"-\")","v":"-"},{"$f":"IFERROR(VLOOKUP(K12,Entries!$A:$D,4,0),\"-\")","v":"-"},{"$f":"IFERROR(VLOOKUP(K12,Entries!$A:$H,8,0),\"-\")","v":"-"},{"$f":"IFERROR(VLOOKUP(K12,Entries!$A:$F,6,0),\"-\")","v":"-"}]
[]
[]
["U11 Boys Heat 2",null,null,null,null,"Wind",null,null,null,"U11 Girls Heat 2",null,null,null,null,"Wind",-2.2999999999999998]
["Pos","Number","Last Name","First Name","Age","Club","Time",null,null,"Pos","Number","Last Name","First Name","Age","Club","Time"]
[1,84,{"$f":"IFERROR(VLOOKUP(B17,Entries!$A:$E,5,0),\"-\")","v":"Brazier"},{"$f":"IFERROR(VLOOKUP(B17,Entries!$A:$D,4,0),\"-\")","v":"James"},{"$f":"IFERROR(VLOOKUP(B17,Entries!$A:$H,8,0),\"-\")","v":9},{"$f":"IFERROR(VLOOKUP(B17,Entries!$A:$F,6,0),\"-\")","v":"SS Athletics"},"12.24",null,null,1,310,{"$f":"IFERROR(VLOOKUP(K17,Entries!$A:$E,5,0),\"-\")","v":"Lewis"},{"$f":"IFERROR(VLOOKUP(K17,Entries!$A:$D,4,0),\"-\")","v":"Emily"},{"$f":"IFERROR(VLOOKUP(K17,Entries!$A:$H,8,0),\"-\")","v":9},{"$f":"IFERROR(VLOOKUP(K17,Entries!$A:$F,6,0),\"-\")","v":"City of Southend On Sea AC"},"12.18"]
[2,162,{"$f":"IFERROR(VLOOKUP(B18,Entries!$A:$E,5,0),\"-\")","v":"Birnie"},{"$f":"IFERROR(VLOOKUP(B18,Entries!$A:$D,4,0),\"-\")","v":"Jack"},{"$f":"IFERROR(VLOOKUP(B18,Entries!$A:$H,8,0),\"-\")","v":9},{"$f":"IFERROR(VLOOKUP(B18,Entries!$A:$F,6,0),\"-\")","v":"Benfleet RC"},"12.57",null,null,2,243,{"$f":"IFERROR(VLOOKUP(K18,Entries!$A:$E,5,0),\"-\")","v":"Garwood"},{"$f":"IFERROR(VLOOKUP(K18,Entries!$A:$D,4,0),\"-\")","v":"Ella-Rose"},{"$f":"IFERROR(VLOOKUP(K18,Entries!$A:$H,8,0),\"-\")","v":9},{"$f":"IFERROR(VLOOKUP(K18,Entries!$A:$F,6,0),\"-\")","v":"SS Athletics"},"12.96"]
[3,168,{"$f":"IFERROR(VLOOKUP(B19,Entries!$A:$E,5,0),\"-\")","v":"Blomfield"},{"$f":"IFERROR(VLOOKUP(B19,Entries!$A:$D,4,0),\"-\")","v":"Jack"},{"$f":"IFERROR(VLOOKUP(B19,Entries!$A:$H,8,0),\"-\")","v":9},{"$f":"IFERROR(VLOOKUP(B19,Entries!$A:$F,6,0),\"-\")","v":"SS Athletics"},"12.77",null,null,3,223,{"$f":"IFERROR(VLOOKUP(K19,Entries!$A:$E,5,0),\"-\")","v":"Emery"},{"$f":"IFERROR(VLOOKUP(K19,Entries!$A:$D,4,0),\"-\")","v":"Isla"},{"$f":"IFERROR(VLOOKUP(K19,Entries!$A:$H,8,0),\"-\")","v":9},{"$f":"IFERROR(VLOOKUP(K19,Entries!$A:$F,6,0),\"-\")","v":"Benfleet RC"},"13.00"]
[4,88,{"$f":"IFERROR(VLOOKUP(B20,Entries!$A:$E,5,0),\"-\")","v":"Stammers"},{"$f":"IFERROR(VLOOKUP(B20,Entries!$A:$D,4,0),\"-\")","v":"Rafael"},{"$f":"IFERROR(VLOOKUP(B20,Entries!$A:$H,8,0),\"-\")","v":9},{"$f":"IFERROR(VLOOKUP(B20,Entries!$A:$F,6,0),\"-\")","v":"Unattached"},"13.22",null,null,4,339,{"$f":"IFERROR(VLOOKUP(K20,Entries!$A:$E,5,0),\"-\")","v":"Williams"},{"$f":"IFERROR(VLOOKUP(K20,Entries!$A:$D,4,0),\"-\")","v":"Tilly"},{"$f":"IFERROR(VLOOKUP(K20,Entries!$A:$H,8,0),\"-\")","v":9},{"$f":"IFERROR(VLOOKUP(K20,Entries!$A:$F,6,0),\"-\")","v":"SS Athletics"},"13.04"]
[5,124,{"$f":"IFERROR(VLOOKUP(B21,Entries!$A:$E,5,0),\"-\")","v":"McKeeganey"},{"$f":"IFERROR(VLOOKUP(B21,Entries!$A:$D,4,0),\"-\")","v":"Zach"},{"$f":"IFERROR(VLOOKUP(B21,Entries!$A:$H,8,0),\"-\")","v":9},{"$f":"IFERROR(VLOOKUP(B21,Entries!$A:$F,6,0),\"-\")","v":"SS Athletics"},"13.34",null,null,5,265,{"$f":"IFERROR(VLOOKUP(K21,Entries!$A:$E,5,0),\"-\")","v":"Hatt"},{"$f":"IFERROR(VLOOKUP(K21,Entries!$A:$D,4,0),\"-\")","v":"Jessica"},{"$f":"IFERROR(VLOOKUP(K21,Entries!$A:$H,8,0),\"-\")","v":9},{"$f":"IFERROR(VLOOKUP(K21,Entries!$A:$F,6,0),\"-\")","v":"SS Athletics"},"13.44"]
[6,80,{"$f":"IFERROR(VLOOKUP(B22,Entries!$A:$E,5,0),\"-\")","v":"Cottee"},{"$f":"IFERROR(VLOOKUP(B22,Entries!$A:$D,4,0),\"-\")","v":"Nathan"},{"$f":"IFERROR(VLOOKUP(B22,Entries!$A:$H,8,0),\"-\")","v":9},{"$f":"IFERROR(VLOOKUP(B22,Entries!$A:$F,6,0),\"-\")","v":"Brentwood Beagles Athletics Club"},"13.37",null,null,6,220,{"$f":"IFERROR(VLOOKUP(K22,Entries!$A:$E,5,0),\"-\")","v":"Grimes"},{"$f":"IFERROR(VLOOKUP(K22,Entries!$A:$D,4,0),\"-\")","v":"Poppy"},{"$f":"IFERROR(VLOOKUP(K22,Entries!$A:$H,8,0),\"-\")","v":9},{"$f":"IFERROR(VLOOKUP(K22,Entries!$A:$F,6,0),\"-\")","v":"SS Athletics"},"13.47"]
[7,131,{"$f":"IFERROR(VLOOKUP(B23,Entries!$A:$E,5,0),\"-\")","v":"Fox"},{"$f":"IFERROR(VLOOKUP(B23,Entries!$A:$D,4,0),\"-\")","v":"Hari"},{"$f":"IFERROR(VLOOKUP(B23,Entries!$A:$H,8,0),\"-\")","v":9},{"$f":"IFERROR(VLOOKUP(B23,Entries!$A:$F,6,0),\"-\")","v":"Unattached"},"15.47",null,null,7,null,{"$f":"IFERROR(VLOOKUP(K23,Entries!$A:$E,5,0),\"-\")","v":"-"},{"$f":"IFERROR(VLOOKUP(K23,Entries!$A:$D,4,0),\"-\")","v":"-"},{"$f":"IFERROR(VLOOKUP(K23,Entries!$A:$H,8,0),\"-\")","v":"-"},{"$f":"IFERROR(VLOOKUP(K23,Entries!$A:$F,6,0),\"-\")","v":"-"}]
[8,null,{"$f":"IFERROR(VLOOKUP(B24,Entries!$A:$E,5,0),\"-\")","v":"-"},{"$f":"IFERROR(VLOOKUP(B24,Entries!$A:$D,4,0),\"-\")","v":"-"},{"$f":"IFERROR(VLOOKUP(B24,Entries!$A:$H,8,0),\"-\")","v":"-"},{"$f":"IFERROR(VLOOKUP(B24,Entries!$A:$F,6,0),\"-\")","v":"-"},null,null,null,8,null,{"$f":"IFERROR(VLOOKUP(K24,Entries!$A:$E,5,0),\"-\")","v":"-"},{"$f":"IFERROR(VLOOKUP(K24,Entries!$A:$D,4,0),\"-\")","v":"-"},{"$f":"IFERROR(VLOOKUP(K24,Entries!$A:$H,8,0),\"-\")","v":"-"},{"$f":"IFERROR(VLOOKUP(K24,Entries!$A:$F,6,0),\"-\")","v":"-"}]
[]
[]
["U11 Boys Heat 3",null,null,null,null,"Wind",null,null,null,"U11 Girls Heat 3",null,null,null,null,"Wind"]
["Pos","Number","Last Name","First Name","Age","Club","Time",null,null,"Pos","Number","Last Name","First Name","Age","Club","Time"]
[1,326,{"$f":"IFERROR(VLOOKUP(B29,Entries!$A:$E,5,0),\"-\")","v":"Kerr"},{"$f":"IFERROR(VLOOKUP(B29,Entries!$A:$D,4,0),\"-\")","v":"Raheim"},{"$f":"IFERROR(VLOOKUP(B29,Entries!$A:$H,8,0),\"-\")","v":10},{"$f":"IFERROR(VLOOKUP(B29,Entries!$A:$F,6,0),\"-\")","v":"SS Athletics"},"11.30",null,null,1,149,{"$f":"IFERROR(VLOOKUP(K29,Entries!$A:$E,5,0),\"-\")","v":"Lyttle"},{"$f":"IFERROR(VLOOKUP(K29,Entries!$A:$D,4,0),\"-\")","v":"Sofia"},{"$f":"IFERROR(VLOOKUP(K29,Entries!$A:$H,8,0),\"-\")","v":10},{"$f":"IFERROR(VLOOKUP(K29,Entries!$A:$F,6,0),\"-\")","v":"Colchester & Tendring AC"},"11.59"]
[2,252,{"$f":"IFERROR(VLOOKUP(B30,Entries!$A:$E,5,0),\"-\")","v":"Jones"},{"$f":"IFERROR(VLOOKUP(B30,Entries!$A:$D,4,0),\"-\")","v":"Oliver"},{"$f":"IFERROR(VLOOKUP(B30,Entries!$A:$H,8,0),\"-\")","v":10},{"$f":"IFERROR(VLOOKUP(B30,Entries!$A:$F,6,0),\"-\")","v":"Brentwood Beagles Athletics Club"},"12.65",null,null,2,49,{"$f":"IFERROR(VLOOKUP(K30,Entries!$A:$E,5,0),\"-\")","v":"Nti-Jackson"},{"$f":"IFERROR(VLOOKUP(K30,Entries!$A:$D,4,0),\"-\")","v":"Danielle"},{"$f":"IFERROR(VLOOKUP(K30,Entries!$A:$H,8,0),\"-\")","v":10},{"$f":"IFERROR(VLOOKUP(K30,Entries!$A:$F,6,0),\"-\")","v":"SS Athletics"},"12.07"]
[3,33,{"$f":"IFERROR(VLOOKUP(B31,Entries!$A:$E,5,0),\"-\")","v":"Boygle"},{"$f":"IFERROR(VLOOKUP(B31,Entries!$A:$D,4,0),\"-\")","v":"Ethan"},{"$f":"IFERROR(VLOOKUP(B31,Entries!$A:$H,8,0),\"-\")","v":8},{"$f":"IFERROR(VLOOKUP(B31,Entries!$A:$F,6,0),\"-\")","v":"Unattached"},"12.74",null,null,3,66,{"$f":"IFERROR(VLOOKUP(K31,Entries!$A:$E,5,0),\"-\")","v":"Hay"},{"$f":"IFERROR(VLOOKUP(K31,Entries!$A:$D,4,0),\"-\")","v":"Bonnie"},{"$f":"IFERROR(VLOOKUP(K31,Entries!$A:$H,8,0),\"-\")","v":10},{"$f":"IFERROR(VLOOKUP(K31,Entries!$A:$F,6,0),\"-\")","v":"SS Athletics"},"12.31"]
[4,232,{"$f":"IFERROR(VLOOKUP(B32,Entries!$A:$E,5,0),\"-\")","v":"Davis"},{"$f":"IFERROR(VLOOKUP(B32,Entries!$A:$D,4,0),\"-\")","v":"Raymond"},{"$f":"IFERROR(VLOOKUP(B32,Entries!$A:$H,8,0),\"-\")","v":10},{"$f":"IFERROR(VLOOKUP(B32,Entries!$A:$F,6,0),\"-\")","v":"SS Athletics"},"12.92",null,null,4,15,{"$f":"IFERROR(VLOOKUP(K32,Entries!$A:$E,5,0),\"-\")","v":"Ekerin"},{"$f":"IFERROR(VLOOKUP(K32,Entries!$A:$D,4,0),\"-\")","v":"Temitope"},{"$f":"IFERROR(VLOOKUP(K32,Entries!$A:$H,8,0),\"-\")","v":10},{"$f":"IFERROR(VLOOKUP(K32,Entries!$A:$F,6,0),\"-\")","v":"Unattached"},"13.21"]
[5,298,{"$f":"IFERROR(VLOOKUP(B33,Entries!$A:$E,5,0),\"-\")","v":"Hickey"},{"$f":"IFERROR(VLOOKUP(B33,Entries!$A:$D,4,0),\"-\")","v":"Leo"},{"$f":"IFERROR(VLOOKUP(B33,Entries!$A:$H,8,0),\"-\")","v":9},{"$f":"IFERROR(VLOOKUP(B33,Entries!$A:$F,6,0),\"-\")","v":"City of Southend On Sea AC"},"13.00",null,null,5,171,{"$f":"IFERROR(VLOOKUP(K33,Entries!$A:$E,5,0),\"-\")","v":"Lupton"},{"$f":"IFERROR(VLOOKUP(K33,Entries!$A:$D,4,0),\"-\")","v":"Hollie"},{"$f":"IFERROR(VLOOKUP(K33,Entries!$A:$H,8,0),\"-\")","v":10},{"$f":"IFERROR(VLOOKUP(K33,Entries!$A:$F,6,0),\"-\")","v":"SS Athletics"},"13.55"]
[6,320,{"$f":"IFERROR(VLOOKUP(B34,Entries!$A:$E,5,0),\"-\")","v":"Cottee"},{"$f":"IFERROR(VLOOKUP(B34,Entries!$A:$D,4,0),\"-\")","v":"Owen"},{"$f":"IFERROR(VLOOKUP(B34,Entries!$A:$H,8,0),\"-\")","v":10},{"$f":"IFERROR(VLOOKUP(B34,Entries!$A:$F,6,0),\"-\")","v":"Brentwood Beagles Athletics Club"},"13.36",null,null,6,null,{"$f":"IFERROR(VLOOKUP(K34,Entries!$A:$E,5,0),\"-\")","v":"-"},{"$f":"IFERROR(VLOOKUP(K34,Entries!$A:$D,4,0),\"-\")","v":"-"},{"$f":"IFERROR(VLOOKUP(K34,Entries!$A:$H,8,0),\"-\")","v":"-"},{"$f":"IFERROR(VLOOKUP(K34,Entries!$A:$F,6,0),\"-\")","v":"-"}]
[7,377,{"$f":"IFERROR(VLOOKUP(B35,Entries!$A:$E,5,0),\"-\")","v":"M Kelly"},{"$f":"IFERROR(VLOOKUP(B35,Entries!$A:$D,4,0),\"-\")","v":"Olly"},{"$f":"IFERROR(VLOOKUP(B35,Entries!$A:$H,8,0),\"-\")","v":10},{"$f":"IFERROR(VLOOKUP(B35,Entries!$A:$F,6,0),\"-\")","v":"Ipswich Jaffa RC"},"14.81",null,null,7,null,{"$f":"IFERROR(VLOOKUP(K35,Entries!$A:$E,5,0),\"-\")","v":"-"},{"$f":"IFERROR(VLOOKUP(K35,Entries!$A:$D,4,0),\"-\")","v":"-"},{"$f":"IFERROR(VLOOKUP(K35,Entries!$A:$H,8,0),\"-\")","v":"-"},{"$f":"IFERROR(VLOOKUP(K35,Entries!$A:$F,6,0),\"-\")","v":"-"}]
[8,null,{"$f":"IFERROR(VLOOKUP(B36,Entries!$A:$E,5,0),\"-\")","v":"-"},{"$f":"IFERROR(VLOOKUP(B36,Entries!$A:$D,4,0),\"-\")","v":"-"},{"$f":"IFERROR(VLOOKUP(B36,Entries!$A:$H,8,0),\"-\")","v":"-"},{"$f":"IFERROR(VLOOKUP(B36,Entries!$A:$F,6,0),\"-\")","v":"-"},null,null,null,8,null,{"$f":"IFERROR(VLOOKUP(K36,Entries!$A:$E,5,0),\"-\")","v":"-"},{"$f":"IFERROR(VLOOKUP(K36,Entries!$A:$D,4,0),\"-\")","v":"-"},{"$f":"IFERROR(VLOOKUP(K36,Entries!$A:$H,8,0),\"-\")","v":"-"},{"$f":"IFERROR(VLOOKUP(K36,Entries!$A:$F,6,0),\"-\")","v":"-"}]
[]
[]
["U11 Boys Heat 4",null,null,null,null,"Wind",null,null,null,"U11 Girls Heat 4",null,null,null,null,"Wind"]
["Pos","Number","Last Name","First Name","Age","Club","Time",null,null,"Pos","Number","Last Name","First Name","Age","Club","Time"]
[1,123,{"$f":"IFERROR(VLOOKUP(B41,Entries!$A:$E,5,0),\"-\")","v":"Holmes"},{"$f":"IFERROR(VLOOKUP(B41,Entries!$A:$D,4,0),\"-\")","v":"Stanley"},{"$f":"IFERROR(VLOOKUP(B41,Entries!$A:$H,8,0),\"-\")","v":10},{"$f":"IFERROR(VLOOKUP(B41,Entries!$A:$F,6,0),\"-\")","v":"SS Athletics"},"12.00",null,null,1,321,{"$f":"IFERROR(VLOOKUP(K41,Entries!$A:$E,5,0),\"-\")","v":"Rowles"},{"$f":"IFERROR(VLOOKUP(K41,Entries!$A:$D,4,0),\"-\")","v":"Clara"},{"$f":"IFERROR(VLOOKUP(K41,Entries!$A:$H,8,0),\"-\")","v":10},{"$f":"IFERROR(VLOOKUP(K41,Entries!$A:$F,6,0),\"-\")","v":"City of Southend On Sea AC"},"12.30"]
[2,93,{"$f":"IFERROR(VLOOKUP(B42,Entries!$A:$E,5,0),\"-\")","v":"Hollidge"},{"$f":"IFERROR(VLOOKUP(B42,Entries!$A:$D,4,0),\"-\")","v":"Eli"},{"$f":"IFERROR(VLOOKUP(B42,Entries!$A:$H,8,0),\"-\")","v":10},{"$f":"IFERROR(VLOOKUP(B42,Entries!$A:$F,6,0),\"-\")","v":"SS Athletics"},"12.06",null,null,2,325,{"$f":"IFERROR(VLOOKUP(K42,Entries!$A:$E,5,0),\"-\")","v":"Ncube"},{"$f":"IFERROR(VLOOKUP(K42,Entries!$A:$D,4,0),\"-\")","v":"Ruvarashe"},{"$f":"IFERROR(VLOOKUP(K42,Entries!$A:$H,8,0),\"-\")","v":10},{"$f":"IFERROR(VLOOKUP(K42,Entries!$A:$F,6,0),\"-\")","v":"City of Southend-on-Sea Athletic Club"},"12.68"]
[3,178,{"$f":"IFERROR(VLOOKUP(B43,Entries!$A:$E,5,0),\"-\")","v":"Schofield"},{"$f":"IFERROR(VLOOKUP(B43,Entries!$A:$D,4,0),\"-\")","v":"Milo"},{"$f":"IFERROR(VLOOKUP(B43,Entries!$A:$H,8,0),\"-\")","v":10},{"$f":"IFERROR(VLOOKUP(B43,Entries!$A:$F,6,0),\"-\")","v":"SS Athletics"},"12.53",null,null,3,368,{"$f":"IFERROR(VLOOKUP(K43,Entries!$A:$E,5,0),\"-\")","v":"Howard"},{"$f":"IFERROR(VLOOKUP(K43,Entries!$A:$D,4,0),\"-\")","v":"Chloe-Anne"},{"$f":"IFERROR(VLOOKUP(K43,Entries!$A:$H,8,0),\"-\")","v":10},{"$f":"IFERROR(VLOOKUP(K43,Entries!$A:$F,6,0),\"-\")","v":"SS Athletics"},"12.71"]
[4,172,{"$f":"IFERROR(VLOOKUP(B44,Entries!$A:$E,5,0),\"-\")","v":"Lupton"},{"$f":"IFERROR(VLOOKUP(B44,Entries!$A:$D,4,0),\"-\")","v":"Joseph"},{"$f":"IFERROR(VLOOKUP(B44,Entries!$A:$H,8,0),\"-\")","v":10},{"$f":"IFERROR(VLOOKUP(B44,Entries!$A:$F,6,0),\"-\")","v":"SS Athletics"},"12.57",null,null,4,255,{"$f":"IFERROR(VLOOKUP(K44,Entries!$A:$E,5,0),\"-\")","v":"Nedkov"},{"$f":"IFERROR(VLOOKUP(K44,Entries!$A:$D,4,0),\"-\")","v":"Rosie"},{"$f":"IFERROR(VLOOKUP(K44,Entries!$A:$H,8,0),\"-\")","v":10},{"$f":"IFERROR(VLOOKUP(K44,Entries!$A:$F,6,0),\"-\")","v":"SS Athletics"},"14.58"]
[5,212,{"$f":"IFERROR(VLOOKUP(B45,Entries!$A:$E,5,0),\"-\")","v":"Sibanda"},{"$f":"IFERROR(VLOOKUP(B45,Entries!$A:$D,4,0),\"-\")","v":"Malachi"},{"$f":"IFERROR(VLOOKUP(B45,Entries!$A:$H,8,0),\"-\")","v":10},{"$f":"IFERROR(VLOOKUP(B45,Entries!$A:$F,6,0),\"-\")","v":"SS Athletics"},"12.68",null,null,5,306,{"$f":"IFERROR(VLOOKUP(K45,Entries!$A:$E,5,0),\"-\")","v":"Khan"},{"$f":"IFERROR(VLOOKUP(K45,Entries!$A:$D,4,0),\"-\")","v":"Zaeemah"},{"$f":"IFERROR(VLOOKUP(K45,Entries!$A:$H,8,0),\"-\")","v":10},{"$f":"IFERROR(VLOOKUP(K45,Entries!$A:$F,6,0),\"-\")","v":"City of Southend On Sea AC"},"14.77"]
[6,280,{"$f":"IFERROR(VLOOKUP(B46,Entries!$A:$E,5,0),\"-\")","v":"Lawton Lloyd"},{"$f":"IFERROR(VLOOKUP(B46,Entries!$A:$D,4,0),\"-\")","v":"Dylan"},{"$f":"IFERROR(VLOOKUP(B46,Entries!$A:$H,8,0),\"-\")","v":9},{"$f":"IFERROR(VLOOKUP(B46,Entries!$A:$F,6,0),\"-\")","v":"SS Athletics"},"12.74",null,null,6,null,{"$f":"IFERROR(VLOOKUP(K46,Entries!$A:$E,5,0),\"-\")","v":"-"},{"$f":"IFERROR(VLOOKUP(K46,Entries!$A:$D,4,0),\"-\")","v":"-"},{"$f":"IFERROR(VLOOKUP(K46,Entries!$A:$H,8,0),\"-\")","v":"-"},{"$f":"IFERROR(VLOOKUP(K46,Entries!$A:$F,6,0),\"-\")","v":"-"}]
[7,null,{"$f":"IFERROR(VLOOKUP(B47,Entries!$A:$E,5,0),\"-\")","v":"-"},{"$f":"IFERROR(VLOOKUP(B47,Entries!$A:$D,4,0),\"-\")","v":"-"},{"$f":"IFERROR(VLOOKUP(B47,Entries!$A:$H,8,0),\"-\")","v":"-"},{"$f":"IFERROR(VLOOKUP(B47,Entries!$A:$F,6,0),\"-\")","v":"-"},null,null,null,7,null,{"$f":"IFERROR(VLOOKUP(K47,Entries!$A:$E,5,0),\"-\")","v":"-"},{"$f":"IFERROR(VLOOKUP(K47,Entries!$A:$D,4,0),\"-\")","v":"-"},{"$f":"IFERROR(VLOOKUP(K47,Entries!$A:$H,8,0),\"-\")","v":"-"},{"$f":"IFERROR(VLOOKUP(K47,Entries!$A:$F,6,0),\"-\")","v":"-"}]
[8,null,{"$f":"IFERROR(VLOOKUP(B48,Entries!$A:$E,5,0),\"-\")","v":"-"},{"$f":"IFERROR(VLOOKUP(B48,Entries!$A:$D,4,0),\"-\")","v":"-"},{"$f":"IFERROR(VLOOKUP(B48,Entries!$A:$H,8,0),\"-\")","v":"-"},{"$f":"IFERROR(VLOOKUP(B48,Entries!$A:$F,6,0),\"-\")","v":"-"},null,null,null,8,null,{"$f":"IFERROR(VLOOKUP(K48,Entries!$A:$E,5,0),\"-\")","v":"-"},{"$f":"IFERROR(VLOOKUP(K48,Entries!$A:$D,4,0),\"-\")","v":"-"},{"$f":"IFERROR(VLOOKUP(K48,Entries!$A:$H,8,0),\"-\")","v":"-"},{"$f":"IFERROR(VLOOKUP(K48,Entries!$A:$F,6,0),\"-\")","v":"-"}]

{"sheet":"100m","index":5,"n_rows":120,"n_cols":15,"rows_kept":120,"cut":false,"hidden":false,"merged":[]}
["100m"]
[]
["U13 Boys Heat 1",null,null,null,null,"Wind",-4.2,null,"U13 Girls Heat 1",null,null,null,null,"Wind"]
["Pos","Number","Last Name","First Name","Age","Club","Time",null,"Pos","Number","Last Name","First Name","Age","Club","Time"]
[1,40,{"$f":"IFERROR(VLOOKUP(B5,Entries!$A:$E,5,0),\"-\")","v":"Cheetham"},{"$f":"IFERROR(VLOOKUP(B5,Entries!$A:$D,4,0),\"-\")","v":"Max"},{"$f":"IFERROR(VLOOKUP(B5,Entries!$A:$H,8,0),\"-\")","v":11},{"$f":"IFERROR(VLOOKUP(B5,Entries!$A:$F,6,0),\"-\")","v":"Brentwood Beagles Athletics Club"},"14.29",null,1,77,{"$f":"IFERROR(VLOOKUP(J5,Entries!$A:$E,5,0),\"-\")","v":"Oladele"},{"$f":"IFERROR(VLOOKUP(J5,Entries!$A:$D,4,0),\"-\")","v":"Davina"},{"$f":"IFERROR(VLOOKUP(J5,Entries!$A:$H,8,0),\"-\")","v":11},{"$f":"IFERROR(VLOOKUP(J5,Entries!$A:$F,6,0),\"-\")","v":"Thurrock Harriers"},"14.43"]
[2,160,{"$f":"IFERROR(VLOOKUP(B6,Entries!$A:$E,5,0),\"-\")","v":"Phillips-Frontin"},{"$f":"IFERROR(VLOOKUP(B6,Entries!$A:$D,4,0),\"-\")","v":"Dylan"},{"$f":"IFERROR(VLOOKUP(B6,Entries!$A:$H,8,0),\"-\")","v":11},{"$f":"IFERROR(VLOOKUP(B6,Entries!$A:$F,6,0),\"-\")","v":"SS Athletics"},"15.44",null,2,151,{"$f":"IFERROR(VLOOKUP(J6,Entries!$A:$E,5,0),\"-\")","v":"Radley"},{"$f":"IFERROR(VLOOKUP(J6,Entries!$A:$D,4,0),\"-\")","v":"Lucia"},{"$f":"IFERROR(VLOOKUP(J6,Entries!$A:$H,8,0),\"-\")","v":11},{"$f":"IFERROR(VLOOKUP(J6,Entries!$A:$F,6,0),\"-\")","v":"SS Athletics"},"14.81"]
[3,248,{"$f":"IFERROR(VLOOKUP(B7,Entries!$A:$E,5,0),\"-\")","v":"Rumsby"},{"$f":"IFERROR(VLOOKUP(B7,Entries!$A:$D,4,0),\"-\")","v":"Noah"},{"$f":"IFERROR(VLOOKUP(B7,Entries!$A:$H,8,0),\"-\")","v":11},{"$f":"IFERROR(VLOOKUP(B7,Entries!$A:$F,6,0),\"-\")","v":"SS Athletics"},"15.50",null,3,1,{"$f":"IFERROR(VLOOKUP(J7,Entries!$A:$E,5,0),\"-\")","v":"Awoyode"},{"$f":"IFERROR(VLOOKUP(J7,Entries!$A:$D,4,0),\"-\")","v":"Maria Oreoluwa"},{"$f":"IFERROR(VLOOKUP(J7,Entries!$A:$H,8,0),\"-\")","v":11},{"$f":"IFERROR(VLOOKUP(J7,Entries!$A:$F,6,0),\"-\")","v":"Aldershot Farnham & District"},"15.48"]
[4,163,{"$f":"IFERROR(VLOOKUP(B8,Entries!$A:$E,5,0),\"-\")","v":"Birnie"},{"$f":"IFERROR(VLOOKUP(B8,Entries!$A:$D,4,0),\"-\")","v":"Ryan"},{"$f":"IFERROR(VLOOKUP(B8,Entries!$A:$H,8,0),\"-\")","v":11},{"$f":"IFERROR(VLOOKUP(B8,Entries!$A:$F,6,0),\"-\")","v":"SS Athletics"},"15.65",null,4,101,{"$f":"IFERROR(VLOOKUP(J8,Entries!$A:$E,5,0),\"-\")","v":"Hallahan"},{"$f":"IFERROR(VLOOKUP(J8,Entries!$A:$D,4,0),\"-\")","v":"Ivy-Rose"},{"$f":"IFERROR(VLOOKUP(J8,Entries!$A:$H,8,0),\"-\")","v":11},{"$f":"IFERROR(VLOOKUP(J8,Entries!$A:$F,6,0),\"-\")","v":"Colchester & Tendring AC"},"15.56"]
[5,158,{"$f":"IFERROR(VLOOKUP(B9,Entries!$A:$E,5,0),\"-\")","v":"Lipscombe"},{"$f":"IFERROR(VLOOKUP(B9,Entries!$A:$D,4,0),\"-\")","v":"Jude"},{"$f":"IFERROR(VLOOKUP(B9,Entries!$A:$H,8,0),\"-\")","v":11},{"$f":"IFERROR(VLOOKUP(B9,Entries!$A:$F,6,0),\"-\")","v":"SS Athletics"},"15.93",null,5,117,{"$f":"IFERROR(VLOOKUP(J9,Entries!$A:$E,5,0),\"-\")","v":"Harris"},{"$f":"IFERROR(VLOOKUP(J9,Entries!$A:$D,4,0),\"-\")","v":"Rose"},{"$f":"IFERROR(VLOOKUP(J9,Entries!$A:$H,8,0),\"-\")","v":11},{"$f":"IFERROR(VLOOKUP(J9,Entries!$A:$F,6,0),\"-\")","v":"SS Athletics"},"16.44"]
[6,126,{"$f":"IFERROR(VLOOKUP(B10,Entries!$A:$E,5,0),\"-\")","v":"Fahmy"},{"$f":"IFERROR(VLOOKUP(B10,Entries!$A:$D,4,0),\"-\")","v":"Seif"},{"$f":"IFERROR(VLOOKUP(B10,Entries!$A:$H,8,0),\"-\")","v":11},{"$f":"IFERROR(VLOOKUP(B10,Entries!$A:$F,6,0),\"-\")","v":"SS Athletics"},"16.51",null,6,null,{"$f":"IFERROR(VLOOKUP(J10,Entries!$A:$E,5,0),\"-\")","v":"-"},{"$f":"IFERROR(VLOOKUP(J10,Entries!$A:$D,4,0),\"-\")","v":"-"},{"$f":"IFERROR(VLOOKUP(J10,Entries!$A:$H,8,0),\"-\")","v":"-"},{"$f":"IFERROR(VLOOKUP(J10,Entries!$A:$F,6,0),\"-\")","v":"-"}]
[7,269,{"$f":"IFERROR(VLOOKUP(B11,Entries!$A:$E,5,0),\"-\")","v":"Frisby-Bright"},{"$f":"IFERROR(VLOOKUP(B11,Entries!$A:$D,4,0),\"-\")","v":"Ethan"},{"$f":"IFERROR(VLOOKUP(B11,Entries!$A:$H,8,0),\"-\")","v":11},{"$f":"IFERROR(VLOOKUP(B11,Entries!$A:$F,6,0),\"-\")","v":"Haverhill Running Club"},"16.87",null,7,null,{"$f":"IFERROR(VLOOKUP(J11,Entries!$A:$E,5,0),\"-\")","v":"-"},{"$f":"IFERROR(VLOOKUP(J11,Entries!$A:$D,4,0),\"-\")","v":"-"},{"$f":"IFERROR(VLOOKUP(J11,Entries!$A:$H,8,0),\"-\")","v":"-"},{"$f":"IFERROR(VLOOKUP(J11,Entries!$A:$F,6,0),\"-\")","v":"-"}]
[8,70,{"$f":"IFERROR(VLOOKUP(B12,Entries!$A:$E,5,0),\"-\")","v":"Adenodi"},{"$f":"IFERROR(VLOOKUP(B12,Entries!$A:$D,4,0),\"-\")","v":"Caleb"},{"$f":"IFERROR(VLOOKUP(B12,Entries!$A:$H,8,0),\"-\")","v":11},{"$f":"IFERROR(VLOOKUP(B12,Entries!$A:$F,6,0),\"-\")","v":"SS Athletics"},"17.10",null,8,null,{"$f":"IFERROR(VLOOKUP(J12,Entries!$A:$E,5,0),\"-\")","v":"-"},{"$f":"IFERROR(VLOOKUP(J12,Entries!$A:$D,4,0),\"-\")","v":"-"},{"$f":"IFERROR(VLOOKUP(J12,Entries!$A:$H,8,0),\"-\")","v":"-"},{"$f":"IFERROR(VLOOKUP(J12,Entries!$A:$F,6,0),\"-\")","v":"-"}]
[]
[]
["U13 Boys Heat 2",null,null,null,null,"Wind",-4.2,null,"U13 Girls Heat 2",null,null,null,null,"Wind",-3.2]
["Pos","Number","Last Name","First Name","Age","Club","Time",null,"Pos","Number","Last Name","First Name","Age","Club","Time"]
[1,119,{"$f":"IFERROR(VLOOKUP(B17,Entries!$A:$E,5,0),\"-\")","v":"Petherbridge"},{"$f":"IFERROR(VLOOKUP(B17,Entries!$A:$D,4,0),\"-\")","v":"Zac"},{"$f":"IFERROR(VLOOKUP(B17,Entries!$A:$H,8,0),\"-\")","v":12},{"$f":"IFERROR(VLOOKUP(B17,Entries!$A:$F,6,0),\"-\")","v":"SS Athletics"},"13.10",null,1,276,{"$f":"IFERROR(VLOOKUP(J17,Entries!$A:$E,5,0),\"-\")","v":"Martell-Smith"},{"$f":"IFERROR(VLOOKUP(J17,Entries!$A:$D,4,0),\"-\")","v":"Lacey"},{"$f":"IFERROR(VLOOKUP(J17,Entries!$A:$H,8,0),\"-\")","v":11},{"$f":"IFERROR(VLOOKUP(J17,Entries!$A:$F,6,0),\"-\")","v":"Colchester Harriers AC"},"14.55"]
[2,65,{"$f":"IFERROR(VLOOKUP(B18,Entries!$A:$E,5,0),\"-\")","v":"Hay"},{"$f":"IFERROR(VLOOKUP(B18,Entries!$A:$D,4,0),\"-\")","v":"Logan"},{"$f":"IFERROR(VLOOKUP(B18,Entries!$A:$H,8,0),\"-\")","v":12},{"$f":"IFERROR(VLOOKUP(B18,Entries!$A:$F,6,0),\"-\")","v":"SS Athletics"},"13.10",null,2,283,{"$f":"IFERROR(VLOOKUP(J18,Entries!$A:$E,5,0),\"-\")","v":"Freese"},{"$f":"IFERROR(VLOOKUP(J18,Entries!$A:$D,4,0),\"-\")","v":"Zara"},{"$f":"IFERROR(VLOOKUP(J18,Entries!$A:$H,8,0),\"-\")","v":11},{"$f":"IFERROR(VLOOKUP(J18,Entries!$A:$F,6,0),\"-\")","v":"SS Athletics"},"14.72"]
[3,118,{"$f":"IFERROR(VLOOKUP(B19,Entries!$A:$E,5,0),\"-\")","v":"Petherbridge"},{"$f":"IFERROR(VLOOKUP(B19,Entries!$A:$D,4,0),\"-\")","v":"Finn"},{"$f":"IFERROR(VLOOKUP(B19,Entries!$A:$H,8,0),\"-\")","v":12},{"$f":"IFERROR(VLOOKUP(B19,Entries!$A:$F,6,0),\"-\")","v":"SS Athletics"},"14.19",null,3,315,{"$f":"IFERROR(VLOOKUP(J19,Entries!$A:$E,5,0),\"-\")","v":"Turner"},{"$f":"IFERROR(VLOOKUP(J19,Entries!$A:$D,4,0),\"-\")","v":"Amelia-Rose"},{"$f":"IFERROR(VLOOKUP(J19,Entries!$A:$H,8,0),\"-\")","v":11},{"$f":"IFERROR(VLOOKUP(J19,Entries!$A:$F,6,0),\"-\")","v":"SS Athletics"},"15.60"]
[4,52,{"$f":"IFERROR(VLOOKUP(B20,Entries!$A:$E,5,0),\"-\")","v":"Stone"},{"$f":"IFERROR(VLOOKUP(B20,Entries!$A:$D,4,0),\"-\")","v":"Bradley"},{"$f":"IFERROR(VLOOKUP(B20,Entries!$A:$H,8,0),\"-\")","v":12},{"$f":"IFERROR(VLOOKUP(B20,Entries!$A:$F,6,0),\"-\")","v":"Hillingdon AC"},"14.63",null,4,262,{"$f":"IFERROR(VLOOKUP(J20,Entries!$A:$E,5,0),\"-\")","v":"Chikandwa"},{"$f":"IFERROR(VLOOKUP(J20,Entries!$A:$D,4,0),\"-\")","v":"Aiyana"},{"$f":"IFERROR(VLOOKUP(J20,Entries!$A:$H,8,0),\"-\")","v":11},{"$f":"IFERROR(VLOOKUP(J20,Entries!$A:$F,6,0),\"-\")","v":"Unattached"},"16.02"]
[5,79,{"$f":"IFERROR(VLOOKUP(B21,Entries!$A:$E,5,0),\"-\")","v":"Cottee"},{"$f":"IFERROR(VLOOKUP(B21,Entries!$A:$D,4,0),\"-\")","v":"Matthew"},{"$f":"IFERROR(VLOOKUP(B21,Entries!$A:$H,8,0),\"-\")","v":12},{"$f":"IFERROR(VLOOKUP(B21,Entries!$A:$F,6,0),\"-\")","v":"Brentwood Beagles Athletics Club"},"15.78",null,5,323,{"$f":"IFERROR(VLOOKUP(J21,Entries!$A:$E,5,0),\"-\")","v":"Higgins"},{"$f":"IFERROR(VLOOKUP(J21,Entries!$A:$D,4,0),\"-\")","v":"Anna"},{"$f":"IFERROR(VLOOKUP(J21,Entries!$A:$H,8,0),\"-\")","v":11},{"$f":"IFERROR(VLOOKUP(J21,Entries!$A:$F,6,0),\"-\")","v":"SS Athletics"},"16.22"]
[6,null,{"$f":"IFERROR(VLOOKUP(B22,Entries!$A:$E,5,0),\"-\")","v":"-"},{"$f":"IFERROR(VLOOKUP(B22,Entries!$A:$D,4,0),\"-\")","v":"-"},{"$f":"IFERROR(VLOOKUP(B22,Entries!$A:$H,8,0),\"-\")","v":"-"},{"$f":"IFERROR(VLOOKUP(B22,Entries!$A:$F,6,0),\"-\")","v":"-"},null,null,6,266,{"$f":"IFERROR(VLOOKUP(J22,Entries!$A:$E,5,0),\"-\")","v":"Tubman"},{"$f":"IFERROR(VLOOKUP(J22,Entries!$A:$D,4,0),\"-\")","v":"Ciara"},{"$f":"IFERROR(VLOOKUP(J22,Entries!$A:$H,8,0),\"-\")","v":11},{"$f":"IFERROR(VLOOKUP(J22,Entries!$A:$F,6,0),\"-\")","v":"City of Southend On Sea AC"},"16.33"]
[7,null,{"$f":"IFERROR(VLOOKUP(B23,Entries!$A:$E,5,0),\"-\")","v":"-"},{"$f":"IFERROR(VLOOKUP(B23,Entries!$A:$D,4,0),\"-\")","v":"-"},{"$f":"IFERROR(VLOOKUP(B23,Entries!$A:$H,8,0),\"-\")","v":"-"},{"$f":"IFERROR(VLOOKUP(B23,Entries!$A:$F,6,0),\"-\")","v":"-"},null,null,7,null,{"$f":"IFERROR(VLOOKUP(J23,Entries!$A:$E,5,0),\"-\")","v":"-"},{"$f":"IFERROR(VLOOKUP(J23,Entries!$A:$D,4,0),\"-\")","v":"-"},{"$f":"IFERROR(VLOOKUP(J23,Entries!$A:$H,8,0),\"-\")","v":"-"},{"$f":"IFERROR(VLOOKUP(J23,Entries!$A:$F,6,0),\"-\")","v":"-"}]
[8,null,{"$f":"IFERROR(VLOOKUP(B24,Entries!$A:$E,5,0),\"-\")","v":"-"},{"$f":"IFERROR(VLOOKUP(B24,Entries!$A:$D,4,0),\"-\")","v":"-"},{"$f":"IFERROR(VLOOKUP(B24,Entries!$A:$H,8,0),\"-\")","v":"-"},{"$f":"IFERROR(VLOOKUP(B24,Entries!$A:$F,6,0),\"-\")","v":"-"},null,null,8,null,{"$f":"IFERROR(VLOOKUP(J24,Entries!$A:$E,5,0),\"-\")","v":"-"},{"$f":"IFERROR(VLOOKUP(J24,Entries!$A:$D,4,0),\"-\")","v":"-"},{"$f":"IFERROR(VLOOKUP(J24,Entries!$A:$H,8,0),\"-\")","v":"-"},{"$f":"IFERROR(VLOOKUP(J24,Entries!$A:$F,6,0),\"-\")","v":"-"}]
[]
[]
["U13 Boys Heat 3",null,null,null,null,"Wind",-4.2,null,"U13 Girls Heat 3",null,null,null,null,"Wind"]
["Pos","Number","Last Name","First Name","Age","Club","Time",null,"Pos","Number","Last Name","First Name","Age","Club","Time"]
[1,369,{"$f":"IFERROR(VLOOKUP(B29,Entries!$A:$E,5,0),\"-\")","v":"Cordell"},{"$f":"IFERROR(VLOOKUP(B29,Entries!$A:$D,4,0),\"-\")","v":"Dylan"},{"$f":"IFERROR(VLOOKUP(B29,Entries!$A:$H,8,0),\"-\")","v":12},{"$f":"IFERROR(VLOOKUP(B29,Entries!$A:$F,6,0),\"-\")","v":"SS Athletics"},"13.50",null,1,11,{"$f":"IFERROR(VLOOKUP(J29,Entries!$A:$E,5,0),\"-\")","v":"Frisby"},{"$f":"IFERROR(VLOOKUP(J29,Entries!$A:$D,4,0),\"-\")","v":"Emma"},{"$f":"IFERROR(VLOOKUP(J29,Entries!$A:$H,8,0),\"-\")","v":12},{"$f":"IFERROR(VLOOKUP(J29,Entries!$A:$F,6,0),\"-\")","v":"City of Southend On Sea AC"},"13.47"]
[2,137,{"$f":"IFERROR(VLOOKUP(B30,Entries!$A:$E,5,0),\"-\")","v":"Hoyte"},{"$f":"IFERROR(VLOOKUP(B30,Entries!$A:$D,4,0),\"-\")","v":"Kairhys"},{"$f":"IFERROR(VLOOKUP(B30,Entries!$A:$H,8,0),\"-\")","v":12},{"$f":"IFERROR(VLOOKUP(B30,Entries!$A:$F,6,0),\"-\")","v":"Brentwood Beagles Athletics Club"},"14.29",null,2,229,{"$f":"IFERROR(VLOOKUP(J30,Entries!$A:$E,5,0),\"-\")","v":"Taylor"},{"$f":"IFERROR(VLOOKUP(J30,Entries!$A:$D,4,0),\"-\")","v":"Scarlett"},{"$f":"IFERROR(VLOOKUP(J30,Entries!$A:$H,8,0),\"-\")","v":12},{"$f":"IFERROR(VLOOKUP(J30,Entries!$A:$F,6,0),\"-\")","v":"Aldershot Farnham & District"},"13.57"]
[3,157,{"$f":"IFERROR(VLOOKUP(B31,Entries!$A:$E,5,0),\"-\")","v":"Tricker"},{"$f":"IFERROR(VLOOKUP(B31,Entries!$A:$D,4,0),\"-\")","v":"Aiden"},{"$f":"IFERROR(VLOOKUP(B31,Entries!$A:$H,8,0),\"-\")","v":12},{"$f":"IFERROR(VLOOKUP(B31,Entries!$A:$F,6,0),\"-\")","v":"SS Athletics"},"14.44",null,3,138,{"$f":"IFERROR(VLOOKUP(J31,Entries!$A:$E,5,0),\"-\")","v":"Marshment"},{"$f":"IFERROR(VLOOKUP(J31,Entries!$A:$D,4,0),\"-\")","v":"Bella"},{"$f":"IFERROR(VLOOKUP(J31,Entries!$A:$H,8,0),\"-\")","v":12},{"$f":"IFERROR(VLOOKUP(J31,Entries!$A:$F,6,0),\"-\")","v":"Herts Phoenix AC"},"14.16"]
[4,329,{"$f":"IFERROR(VLOOKUP(B32,Entries!$A:$E,5,0),\"-\")","v":"Keenan"},{"$f":"IFERROR(VLOOKUP(B32,Entries!$A:$D,4,0),\"-\")","v":"Xavier"},{"$f":"IFERROR(VLOOKUP(B32,Entries!$A:$H,8,0),\"-\")","v":12},{"$f":"IFERROR(VLOOKUP(B32,Entries!$A:$F,6,0),\"-\")","v":"SS Athletics"},"14.65",null,4,303,{"$f":"IFERROR(VLOOKUP(J32,Entries!$A:$E,5,0),\"-\")","v":"Bucci"},{"$f":"IFERROR(VLOOKUP(J32,Entries!$A:$D,4,0),\"-\")","v":"Kai"},{"$f":"IFERROR(VLOOKUP(J32,Entries!$A:$H,8,0),\"-\")","v":12},{"$f":"IFERROR(VLOOKUP(J32,Entries!$A:$F,6,0),\"-\")","v":"SS Athletics"},"14.30"]
[5,null,{"$f":"IFERROR(VLOOKUP(B33,Entries!$A:$E,5,0),\"-\")","v":"-"},{"$f":"IFERROR(VLOOKUP(B33,Entries!$A:$D,4,0),\"-\")","v":"-"},{"$f":"IFERROR(VLOOKUP(B33,Entries!$A:$H,8,0),\"-\")","v":"-"},{"$f":"IFERROR(VLOOKUP(B33,Entries!$A:$F,6,0),\"-\")","v":"-"},null,null,5,136,{"$f":"IFERROR(VLOOKUP(J33,Entries!$A:$E,5,0),\"-\")","v":"Hoyte"},{"$f":"IFERROR(VLOOKUP(J33,Entries!$A:$D,4,0),\"-\")","v":"Dolci"},{"$f":"IFERROR(VLOOKUP(J33,Entries!$A:$H,8,0),\"-\")","v":12},{"$f":"IFERROR(VLOOKUP(J33,Entries!$A:$F,6,0),\"-\")","v":"Brentwood Beagles Athletics Club"},"14.45"]
[6,null,{"$f":"IFERROR(VLOOKUP(B34,Entries!$A:$E,5,0),\"-\")","v":"-"},{"$f":"IFERROR(VLOOKUP(B34,Entries!$A:$D,4,0),\"-\")","v":"-"},{"$f":"IFERROR(VLOOKUP(B34,Entries!$A:$H,8,0),\"-\")","v":"-"},{"$f":"IFERROR(VLOOKUP(B34,Entries!$A:$F,6,0),\"-\")","v":"-"},null,null,6,22,{"$f":"IFERROR(VLOOKUP(J34,Entries!$A:$E,5,0),\"-\")","v":"Amadin"},{"$f":"IFERROR(VLOOKUP(J34,Entries!$A:$D,4,0),\"-\")","v":"Amenze"},{"$f":"IFERROR(VLOOKUP(J34,Entries!$A:$H,8,0),\"-\")","v":12},{"$f":"IFERROR(VLOOKUP(J34,Entries!$A:$F,6,0),\"-\")","v":"City of Southend On Sea AC"},"14.86"]
[7,null,{"$f":"IFERROR(VLOOKUP(B35,Entries!$A:$E,5,0),\"-\")","v":"-"},{"$f":"IFERROR(VLOOKUP(B35,Entries!$A:$D,4,0),\"-\")","v":"-"},{"$f":"IFERROR(VLOOKUP(B35,Entries!$A:$H,8,0),\"-\")","v":"-"},{"$f":"IFERROR(VLOOKUP(B35,Entries!$A:$F,6,0),\"-\")","v":"-"},null,null,7,null,{"$f":"IFERROR(VLOOKUP(J35,Entries!$A:$E,5,0),\"-\")","v":"-"},{"$f":"IFERROR(VLOOKUP(J35,Entries!$A:$D,4,0),\"-\")","v":"-"},{"$f":"IFERROR(VLOOKUP(J35,Entries!$A:$H,8,0),\"-\")","v":"-"},{"$f":"IFERROR(VLOOKUP(J35,Entries!$A:$F,6,0),\"-\")","v":"-"}]
[8,null,{"$f":"IFERROR(VLOOKUP(B36,Entries!$A:$E,5,0),\"-\")","v":"-"},{"$f":"IFERROR(VLOOKUP(B36,Entries!$A:$D,4,0),\"-\")","v":"-"},{"$f":"IFERROR(VLOOKUP(B36,Entries!$A:$H,8,0),\"-\")","v":"-"},{"$f":"IFERROR(VLOOKUP(B36,Entries!$A:$F,6,0),\"-\")","v":"-"},null,null,8,null,{"$f":"IFERROR(VLOOKUP(J36,Entries!$A:$E,5,0),\"-\")","v":"-"},{"$f":"IFERROR(VLOOKUP(J36,Entries!$A:$D,4,0),\"-\")","v":"-"},{"$f":"IFERROR(VLOOKUP(J36,Entries!$A:$H,8,0),\"-\")","v":"-"},{"$f":"IFERROR(VLOOKUP(J36,Entries!$A:$F,6,0),\"-\")","v":"-"}]
[]
[]
[null,null,null,null,null,null,null,null,"U13 Girls Heat 4",null,null,null,null,"Wind",-1.9]
[null,null,null,null,null,null,null,null,"Pos","Number","Last Name","First Name","Age","Club","Time"]
[null,null,null,null,null,null,null,null,1,78,{"$f":"IFERROR(VLOOKUP(J41,Entries!$A:$E,5,0),\"-\")","v":"Simpson"},{"$f":"IFERROR(VLOOKUP(J41,Entries!$A:$D,4,0),\"-\")","v":"Kylin"},{"$f":"IFERROR(VLOOKUP(J41,Entries!$A:$H,8,0),\"-\")","v":12},{"$f":"IFERROR(VLOOKUP(J41,Entries!$A:$F,6,0),\"-\")","v":"Aldershot Farnham & District"},"13.90"]
[null,null,null,null,null,null,null,null,2,99,{"$f":"IFERROR(VLOOKUP(J42,Entries!$A:$E,5,0),\"-\")","v":"Bozorgi"},{"$f":"IFERROR(VLOOKUP(J42,Entries!$A:$D,4,0),\"-\")","v":"Dina"},{"$f":"IFERROR(VLOOKUP(J42,Entries!$A:$H,8,0),\"-\")","v":12},{"$f":"IFERROR(VLOOKUP(J42,Entries!$A:$F,6,0),\"-\")","v":"Watford Harriers"},"14.59"]
[null,null,null,null,null,null,null,null,3,249,{"$f":"IFERROR(VLOOKUP(J43,Entries!$A:$E,5,0),\"-\")","v":"Boamah"},{"$f":"IFERROR(VLOOKUP(J43,Entries!$A:$D,4,0),\"-\")","v":"Bria"},{"$f":"IFERROR(VLOOKUP(J43,Entries!$A:$H,8,0),\"-\")","v":12},{"$f":"IFERROR(VLOOKUP(J43,Entries!$A:$F,6,0),\"-\")","v":"Herts Phoenix AC"},"15.19"]
[null,null,null,null,null,null,null,null,4,120,{"$f":"IFERROR(VLOOKUP(J44,Entries!$A:$E,5,0),\"-\")","v":"Demello "},{"$f":"IFERROR(VLOOKUP(J44,Entries!$A:$D,4,0),\"-\")","v":"Scarlett "},{"$f":"IFERROR(VLOOKUP(J44,Entries!$A:$H,8,0),\"-\")","v":12},{"$f":"IFERROR(VLOOKUP(J44,Entries!$A:$F,6,0),\"-\")","v":"SS Athletics"},"15.19"]
[null,null,null,null,null,null,null,null,5,309,{"$f":"IFERROR(VLOOKUP(J45,Entries!$A:$E,5,0),\"-\")","v":"Sandell"},{"$f":"IFERROR(VLOOKUP(J45,Entries!$A:$D,4,0),\"-\")","v":"Anais"},{"$f":"IFERROR(VLOOKUP(J45,Entries!$A:$H,8,0),\"-\")","v":12},{"$f":"IFERROR(VLOOKUP(J45,Entries!$A:$F,6,0),\"-\")","v":"SS Athletics"},"16.07"]
[null,null,null,null,null,null,null,null,6,67,{"$f":"IFERROR(VLOOKUP(J46,Entries!$A:$E,5,0),\"-\")","v":"Tasneem"},{"$f":"IFERROR(VLOOKUP(J46,Entries!$A:$D,4,0),\"-\")","v":"Evie"},{"$f":"IFERROR(VLOOKUP(J46,Entries!$A:$H,8,0),\"-\")","v":12},{"$f":"IFERROR(VLOOKUP(J46,Entries!$A:$F,6,0),\"-\")","v":"Basildon AC"},"16.16"]
[null,null,null,null,null,null,null,null,7,null,{"$f":"IFERROR(VLOOKUP(J47,Entries!$A:$E,5,0),\"-\")","v":"-"},{"$f":"IFERROR(VLOOKUP(J47,Entries!$A:$D,4,0),\"-\")","v":"-"},{"$f":"IFERROR(VLOOKUP(J47,Entries!$A:$H,8,0),\"-\")","v":"-"},{"$f":"IFERROR(VLOOKUP(J47,Entries!$A:$F,6,0),\"-\")","v":"-"}]
[]
[]
[]
["U15 Boys Heat 1",null,null,null,null,"Wind",-5.0999999999999996,null,"U15 Girls Heat 1",null,null,null,null,"Wind",-5.4]
["Pos","Number","Last Name","First Name","Age","Club","Time",null,"Pos","Number","Last Name","First Name","Age","Club","Time"]
[1,145,{"$f":"IFERROR(VLOOKUP(B53,Entries!$A:$E,5,0),\"-\")","v":"Bates"},{"$f":"IFERROR(VLOOKUP(B53,Entries!$A:$D,4,0),\"-\")","v":"Finn"},{"$f":"IFERROR(VLOOKUP(B53,Entries!$A:$H,8,0),\"-\")","v":14},{"$f":"IFERROR(VLOOKUP(B53,Entries!$A:$F,6,0),\"-\")","v":"Colchester & Tendring AC"},"12.51",null,1,27,{"$f":"IFERROR(VLOOKUP(J53,Entries!$A:$E,5,0),\"-\")","v":"Boygle"},{"$f":"IFERROR(VLOOKUP(J53,Entries!$A:$D,4,0),\"-\")","v":"Evie"},{"$f":"IFERROR(VLOOKUP(J53,Entries!$A:$H,8,0),\"-\")","v":13},{"$f":"IFERROR(VLOOKUP(J53,Entries!$A:$F,6,0),\"-\")","v":"City of Southend On Sea AC"},"13.36"]
[2,374,{"$f":"IFERROR(VLOOKUP(B54,Entries!$A:$E,5,0),\"-\")","v":"Mendoza"},{"$f":"IFERROR(VLOOKUP(B54,Entries!$A:$D,4,0),\"-\")","v":"Daniel"},{"$f":"IFERROR(VLOOKUP(B54,Entries!$A:$H,8,0),\"-\")","v":14},{"$f":"IFERROR(VLOOKUP(B54,Entries!$A:$F,6,0),\"-\")","v":"City of Southend On Sea AC"},"13.20",null,2,222,{"$f":"IFERROR(VLOOKUP(J54,Entries!$A:$E,5,0),\"-\")","v":"Oakley"},{"$f":"IFERROR(VLOOKUP(J54,Entries!$A:$D,4,0),\"-\")","v":"Pixie"},{"$f":"IFERROR(VLOOKUP(J54,Entries!$A:$H,8,0),\"-\")","v":13},{"$f":"IFERROR(VLOOKUP(J54,Entries!$A:$F,6,0),\"-\")","v":"City of Southend On Sea AC"},"13.78"]
[3,263,{"$f":"IFERROR(VLOOKUP(B55,Entries!$A:$E,5,0),\"-\")","v":"Thompson"},{"$f":"IFERROR(VLOOKUP(B55,Entries!$A:$D,4,0),\"-\")","v":"George"},{"$f":"IFERROR(VLOOKUP(B55,Entries!$A:$H,8,0),\"-\")","v":13},{"$f":"IFERROR(VLOOKUP(B55,Entries!$A:$F,6,0),\"-\")","v":"City of Southend On Sea AC"},"13.28",null,3,215,{"$f":"IFERROR(VLOOKUP(J55,Entries!$A:$E,5,0),\"-\")","v":"Hawkins"},{"$f":"IFERROR(VLOOKUP(J55,Entries!$A:$D,4,0),\"-\")","v":"Nicole"},{"$f":"IFERROR(VLOOKUP(J55,Entries!$A:$H,8,0),\"-\")","v":14},{"$f":"IFERROR(VLOOKUP(J55,Entries!$A:$F,6,0),\"-\")","v":"Brentwood Beagles Athletics Club"},"13.92"]
[4,63,{"$f":"IFERROR(VLOOKUP(B56,Entries!$A:$E,5,0),\"-\")","v":"Hill"},{"$f":"IFERROR(VLOOKUP(B56,Entries!$A:$D,4,0),\"-\")","v":"George"},{"$f":"IFERROR(VLOOKUP(B56,Entries!$A:$H,8,0),\"-\")","v":13},{"$f":"IFERROR(VLOOKUP(B56,Entries!$A:$F,6,0),\"-\")","v":"City of Southend On Sea AC"},"13.32",null,4,170,{"$f":"IFERROR(VLOOKUP(J56,Entries!$A:$E,5,0),\"-\")","v":"Turner"},{"$f":"IFERROR(VLOOKUP(J56,Entries!$A:$D,4,0),\"-\")","v":"Lola"},{"$f":"IFERROR(VLOOKUP(J56,Entries!$A:$H,8,0),\"-\")","v":13},{"$f":"IFERROR(VLOOKUP(J56,Entries!$A:$F,6,0),\"-\")","v":"SS Athletics"},"14.47"]
[5,356,{"$f":"IFERROR(VLOOKUP(B57,Entries!$A:$E,5,0),\"-\")","v":"Bajela"},{"$f":"IFERROR(VLOOKUP(B57,Entries!$A:$D,4,0),\"-\")","v":"Isaac"},{"$f":"IFERROR(VLOOKUP(B57,Entries!$A:$H,8,0),\"-\")","v":14},{"$f":"IFERROR(VLOOKUP(B57,Entries!$A:$F,6,0),\"-\")","v":"City of Southend On Sea AC"},"13.84",null,5,305,{"$f":"IFERROR(VLOOKUP(J57,Entries!$A:$E,5,0),\"-\")","v":"Bucci"},{"$f":"IFERROR(VLOOKUP(J57,Entries!$A:$D,4,0),\"-\")","v":"Keiki"},{"$f":"IFERROR(VLOOKUP(J57,Entries!$A:$H,8,0),\"-\")","v":14},{"$f":"IFERROR(VLOOKUP(J57,Entries!$A:$F,6,0),\"-\")","v":"SS Athletics"},"14.66"]
[6,247,{"$f":"IFERROR(VLOOKUP(B58,Entries!$A:$E,5,0),\"-\")","v":"Kelly"},{"$f":"IFERROR(VLOOKUP(B58,Entries!$A:$D,4,0),\"-\")","v":"Alfie"},{"$f":"IFERROR(VLOOKUP(B58,Entries!$A:$H,8,0),\"-\")","v":13},{"$f":"IFERROR(VLOOKUP(B58,Entries!$A:$F,6,0),\"-\")","v":"Ipswich Jaffa RC"},"13.87",null,6,null,{"$f":"IFERROR(VLOOKUP(J58,Entries!$A:$E,5,0),\"-\")","v":"-"},{"$f":"IFERROR(VLOOKUP(J58,Entries!$A:$D,4,0),\"-\")","v":"-"},{"$f":"IFERROR(VLOOKUP(J58,Entries!$A:$H,8,0),\"-\")","v":"-"},{"$f":"IFERROR(VLOOKUP(J58,Entries!$A:$F,6,0),\"-\")","v":"-"}]
[7,null,{"$f":"IFERROR(VLOOKUP(B59,Entries!$A:$E,5,0),\"-\")","v":"-"},{"$f":"IFERROR(VLOOKUP(B59,Entries!$A:$D,4,0),\"-\")","v":"-"},{"$f":"IFERROR(VLOOKUP(B59,Entries!$A:$H,8,0),\"-\")","v":"-"},{"$f":"IFERROR(VLOOKUP(B59,Entries!$A:$F,6,0),\"-\")","v":"-"},null,null,7,null,{"$f":"IFERROR(VLOOKUP(J59,Entries!$A:$E,5,0),\"-\")","v":"-"},{"$f":"IFERROR(VLOOKUP(J59,Entries!$A:$D,4,0),\"-\")","v":"-"},{"$f":"IFERROR(VLOOKUP(J59,Entries!$A:$H,8,0),\"-\")","v":"-"},{"$f":"IFERROR(VLOOKUP(J59,Entries!$A:$F,6,0),\"-\")","v":"-"}]
[8,null,{"$f":"IFERROR(VLOOKUP(B60,Entries!$A:$E,5,0),\"-\")","v":"-"},{"$f":"IFERROR(VLOOKUP(B60,Entries!$A:$D,4,0),\"-\")","v":"-"},{"$f":"IFERROR(VLOOKUP(B60,Entries!$A:$H,8,0),\"-\")","v":"-"},{"$f":"IFERROR(VLOOKUP(B60,Entries!$A:$F,6,0),\"-\")","v":"-"},null,null,8,null,{"$f":"IFERROR(VLOOKUP(J60,Entries!$A:$E,5,0),\"-\")","v":"-"},{"$f":"IFERROR(VLOOKUP(J60,Entries!$A:$D,4,0),\"-\")","v":"-"},{"$f":"IFERROR(VLOOKUP(J60,Entries!$A:$H,8,0),\"-\")","v":"-"},{"$f":"IFERROR(VLOOKUP(J60,Entries!$A:$F,6,0),\"-\")","v":"-"}]
[]
[]
["U15 Boys Heat 2",null,null,null,null,"Wind",null,null,"U15 Girls Heat 2",null,null,null,null,"Wind",-4.3]
["Pos","Number","Last Name","First Name","Age","Club","Time",null,"Pos","Number","Last Name","First Name","Age","Club","Time"]
[1,null,{"$f":"IFERROR(VLOOKUP(B65,Entries!$A:$E,5,0),\"-\")","v":"-"},{"$f":"IFERROR(VLOOKUP(B65,Entries!$A:$D,4,0),\"-\")","v":"-"},{"$f":"IFERROR(VLOOKUP(B65,Entries!$A:$H,8,0),\"-\")","v":"-"},{"$f":"IFERROR(VLOOKUP(B65,Entries!$A:$F,6,0),\"-\")","v":"-"},null,null,1,202,{"$f":"IFERROR(VLOOKUP(J65,Entries!$A:$E,5,0),\"-\")","v":"Newton"},{"$f":"IFERROR(VLOOKUP(J65,Entries!$A:$D,4,0),\"-\")","v":"Alba"},{"$f":"IFERROR(VLOOKUP(J65,Entries!$A:$H,8,0),\"-\")","v":13},{"$f":"IFERROR(VLOOKUP(J65,Entries!$A:$F,6,0),\"-\")","v":"City of Southend On Sea AC"},"15.13"]
[2,null,{"$f":"IFERROR(VLOOKUP(B66,Entries!$A:$E,5,0),\"-\")","v":"-"},{"$f":"IFERROR(VLOOKUP(B66,Entries!$A:$D,4,0),\"-\")","v":"-"},{"$f":"IFERROR(VLOOKUP(B66,Entries!$A:$H,8,0),\"-\")","v":"-"},{"$f":"IFERROR(VLOOKUP(B66,Entries!$A:$F,6,0),\"-\")","v":"-"},null,null,2,54,{"$f":"IFERROR(VLOOKUP(J66,Entries!$A:$E,5,0),\"-\")","v":"Rushworth"},{"$f":"IFERROR(VLOOKUP(J66,Entries!$A:$D,4,0),\"-\")","v":"Annalise"},{"$f":"IFERROR(VLOOKUP(J66,Entries!$A:$H,8,0),\"-\")","v":13},{"$f":"IFERROR(VLOOKUP(J66,Entries!$A:$F,6,0),\"-\")","v":"Windsor Slough Eton & Hounslow AC"},"15.15"]
[3,null,{"$f":"IFERROR(VLOOKUP(B67,Entries!$A:$E,5,0),\"-\")","v":"-"},{"$f":"IFERROR(VLOOKUP(B67,Entries!$A:$D,4,0),\"-\")","v":"-"},{"$f":"IFERROR(VLOOKUP(B67,Entries!$A:$H,8,0),\"-\")","v":"-"},{"$f":"IFERROR(VLOOKUP(B67,Entries!$A:$F,6,0),\"-\")","v":"-"},null,null,3,191,{"$f":"IFERROR(VLOOKUP(J67,Entries!$A:$E,5,0),\"-\")","v":"Moss"},{"$f":"IFERROR(VLOOKUP(J67,Entries!$A:$D,4,0),\"-\")","v":"Cherri"},{"$f":"IFERROR(VLOOKUP(J67,Entries!$A:$H,8,0),\"-\")","v":13},{"$f":"IFERROR(VLOOKUP(J67,Entries!$A:$F,6,0),\"-\")","v":"Chelmsford AC"},"15.25"]
[4,null,{"$f":"IFERROR(VLOOKUP(B68,Entries!$A:$E,5,0),\"-\")","v":"-"},{"$f":"IFERROR(VLOOKUP(B68,Entries!$A:$D,4,0),\"-\")","v":"-"},{"$f":"IFERROR(VLOOKUP(B68,Entries!$A:$H,8,0),\"-\")","v":"-"},{"$f":"IFERROR(VLOOKUP(B68,Entries!$A:$F,6,0),\"-\")","v":"-"},null,null,4,64,{"$f":"IFERROR(VLOOKUP(J68,Entries!$A:$E,5,0),\"-\")","v":"McCart"},{"$f":"IFERROR(VLOOKUP(J68,Entries!$A:$D,4,0),\"-\")","v":"Harriet"},{"$f":"IFERROR(VLOOKUP(J68,Entries!$A:$H,8,0),\"-\")","v":14},{"$f":"IFERROR(VLOOKUP(J68,Entries!$A:$F,6,0),\"-\")","v":"Ipswich Jaffa RC"},"15.31"]
[5,null,{"$f":"IFERROR(VLOOKUP(B69,Entries!$A:$E,5,0),\"-\")","v":"-"},{"$f":"IFERROR(VLOOKUP(B69,Entries!$A:$D,4,0),\"-\")","v":"-"},{"$f":"IFERROR(VLOOKUP(B69,Entries!$A:$H,8,0),\"-\")","v":"-"},{"$f":"IFERROR(VLOOKUP(B69,Entries!$A:$F,6,0),\"-\")","v":"-"},null,null,5,null,{"$f":"IFERROR(VLOOKUP(J69,Entries!$A:$E,5,0),\"-\")","v":"-"},{"$f":"IFERROR(VLOOKUP(J69,Entries!$A:$D,4,0),\"-\")","v":"-"},{"$f":"IFERROR(VLOOKUP(J69,Entries!$A:$H,8,0),\"-\")","v":"-"},{"$f":"IFERROR(VLOOKUP(J69,Entries!$A:$F,6,0),\"-\")","v":"-"}]
[6,null,{"$f":"IFERROR(VLOOKUP(B70,Entries!$A:$E,5,0),\"-\")","v":"-"},{"$f":"IFERROR(VLOOKUP(B70,Entries!$A:$D,4,0),\"-\")","v":"-"},{"$f":"IFERROR(VLOOKUP(B70,Entries!$A:$H,8,0),\"-\")","v":"-"},{"$f":"IFERROR(VLOOKUP(B70,Entries!$A:$F,6,0),\"-\")","v":"-"},null,null,6,null,{"$f":"IFERROR(VLOOKUP(J70,Entries!$A:$E,5,0),\"-\")","v":"-"},{"$f":"IFERROR(VLOOKUP(J70,Entries!$A:$D,4,0),\"-\")","v":"-"},{"$f":"IFERROR(VLOOKUP(J70,Entries!$A:$H,8,0),\"-\")","v":"-"},{"$f":"IFERROR(VLOOKUP(J70,Entries!$A:$F,6,0),\"-\")","v":"-"}]
[7,null,{"$f":"IFERROR(VLOOKUP(B71,Entries!$A:$E,5,0),\"-\")","v":"-"},{"$f":"IFERROR(VLOOKUP(B71,Entries!$A:$D,4,0),\"-\")","v":"-"},{"$f":"IFERROR(VLOOKUP(B71,Entries!$A:$H,8,0),\"-\")","v":"-"},{"$f":"IFERROR(VLOOKUP(B71,Entries!$A:$F,6,0),\"-\")","v":"-"},null,null,7,null,{"$f":"IFERROR(VLOOKUP(J71,Entries!$A:$E,5,0),\"-\")","v":"-"},{"$f":"IFERROR(VLOOKUP(J71,Entries!$A:$D,4,0),\"-\")","v":"-"},{"$f":"IFERROR(VLOOKUP(J71,Entries!$A:$H,8,0),\"-\")","v":"-"},{"$f":"IFERROR(VLOOKUP(J71,Entries!$A:$F,6,0),\"-\")","v":"-"}]
[8,null,{"$f":"IFERROR(VLOOKUP(B72,Entries!$A:$E,5,0),\"-\")","v":"-"},{"$f":"IFERROR(VLOOKUP(B72,Entries!$A:$D,4,0),\"-\")","v":"-"},{"$f":"IFERROR(VLOOKUP(B72,Entries!$A:$H,8,0),\"-\")","v":"-"},{"$f":"IFERROR(VLOOKUP(B72,Entries!$A:$F,6,0),\"-\")","v":"-"},null,null,8,null,{"$f":"IFERROR(VLOOKUP(J72,Entries!$A:$E,5,0),\"-\")","v":"-"},{"$f":"IFERROR(VLOOKUP(J72,Entries!$A:$D,4,0),\"-\")","v":"-"},{"$f":"IFERROR(VLOOKUP(J72,Entries!$A:$H,8,0),\"-\")","v":"-"},{"$f":"IFERROR(VLOOKUP(J72,Entries!$A:$F,6,0),\"-\")","v":"-"}]
[]
[]
["U17 Men",null,null,null,null,"Wind",-3.6,null,"U17 Women",null,null,null,null,"Wind",-1.6]
["Pos","Number","Last Name","First Name","Age","Club","Time",null,"Pos","Number","Last Name","First Name","Age","Club","Time"]
[1,331,{"$f":"IFERROR(VLOOKUP(B77,Entries!$A:$E,5,0),\"-\")","v":"Adeosun"},{"$f":"IFERROR(VLOOKUP(B77,Entries!$A:$D,4,0),\"-\")","v":"Maxwell"},{"$f":"IFERROR(VLOOKUP(B77,Entries!$A:$H,8,0),\"-\")","v":15},{"$f":"IFERROR(VLOOKUP(B77,Entries!$A:$F,6,0),\"-\")","v":"Havering AC"},"11.86",null,1,20,{"$f":"IFERROR(VLOOKUP(J77,Entries!$A:$E,5,0),\"-\")","v":"Frisby"},{"$f":"IFERROR(VLOOKUP(J77,Entries!$A:$D,4,0),\"-\")","v":"Erin"},{"$f":"IFERROR(VLOOKUP(J77,Entries!$A:$H,8,0),\"-\")","v":15},{"$f":"IFERROR(VLOOKUP(J77,Entries!$A:$F,6,0),\"-\")","v":"City of Southend On Sea AC"},"13.25"]
[2,353,{"$f":"IFERROR(VLOOKUP(B78,Entries!$A:$E,5,0),\"-\")","v":"Whiteley"},{"$f":"IFERROR(VLOOKUP(B78,Entries!$A:$D,4,0),\"-\")","v":"Jerome"},{"$f":"IFERROR(VLOOKUP(B78,Entries!$A:$H,8,0),\"-\")","v":15},{"$f":"IFERROR(VLOOKUP(B78,Entries!$A:$F,6,0),\"-\")","v":"City of Southend On Sea AC"},"12.09",null,2,null,{"$f":"IFERROR(VLOOKUP(J78,Entries!$A:$E,5,0),\"-\")","v":"-"},{"$f":"IFERROR(VLOOKUP(J78,Entries!$A:$D,4,0),\"-\")","v":"-"},{"$f":"IFERROR(VLOOKUP(J78,Entries!$A:$H,8,0),\"-\")","v":"-"},{"$f":"IFERROR(VLOOKUP(J78,Entries!$A:$F,6,0),\"-\")","v":"-"}]
[3,256,{"$f":"IFERROR(VLOOKUP(B79,Entries!$A:$E,5,0),\"-\")","v":"Jaimon"},{"$f":"IFERROR(VLOOKUP(B79,Entries!$A:$D,4,0),\"-\")","v":"Thomas"},{"$f":"IFERROR(VLOOKUP(B79,Entries!$A:$H,8,0),\"-\")","v":15},{"$f":"IFERROR(VLOOKUP(B79,Entries!$A:$F,6,0),\"-\")","v":"SS Athletics"},"13.02",null,3,null,{"$f":"IFERROR(VLOOKUP(J79,Entries!$A:$E,5,0),\"-\")","v":"-"},{"$f":"IFERROR(VLOOKUP(J79,Entries!$A:$D,4,0),\"-\")","v":"-"},{"$f":"IFERROR(VLOOKUP(J79,Entries!$A:$H,8,0),\"-\")","v":"-"},{"$f":"IFERROR(VLOOKUP(J79,Entries!$A:$F,6,0),\"-\")","v":"-"}]
[4,null,{"$f":"IFERROR(VLOOKUP(B80,Entries!$A:$E,5,0),\"-\")","v":"-"},{"$f":"IFERROR(VLOOKUP(B80,Entries!$A:$D,4,0),\"-\")","v":"-"},{"$f":"IFERROR(VLOOKUP(B80,Entries!$A:$H,8,0),\"-\")","v":"-"},{"$f":"IFERROR(VLOOKUP(B80,Entries!$A:$F,6,0),\"-\")","v":"-"},null,null,4,null,{"$f":"IFERROR(VLOOKUP(J80,Entries!$A:$E,5,0),\"-\")","v":"-"},{"$f":"IFERROR(VLOOKUP(J80,Entries!$A:$D,4,0),\"-\")","v":"-"},{"$f":"IFERROR(VLOOKUP(J80,Entries!$A:$H,8,0),\"-\")","v":"-"},{"$f":"IFERROR(VLOOKUP(J80,Entries!$A:$F,6,0),\"-\")","v":"-"}]
[5,null,{"$f":"IFERROR(VLOOKUP(B81,Entries!$A:$E,5,0),\"-\")","v":"-"},{"$f":"IFERROR(VLOOKUP(B81,Entries!$A:$D,4,0),\"-\")","v":"-"},{"$f":"IFERROR(VLOOKUP(B81,Entries!$A:$H,8,0),\"-\")","v":"-"},{"$f":"IFERROR(VLOOKUP(B81,Entries!$A:$F,6,0),\"-\")","v":"-"},null,null,5,null,{"$f":"IFERROR(VLOOKUP(J81,Entries!$A:$E,5,0),\"-\")","v":"-"},{"$f":"IFERROR(VLOOKUP(J81,Entries!$A:$D,4,0),\"-\")","v":"-"},{"$f":"IFERROR(VLOOKUP(J81,Entries!$A:$H,8,0),\"-\")","v":"-"},{"$f":"IFERROR(VLOOKUP(J81,Entries!$A:$F,6,0),\"-\")","v":"-"}]
[6,null,{"$f":"IFERROR(VLOOKUP(B82,Entries!$A:$E,5,0),\"-\")","v":"-"},{"$f":"IFERROR(VLOOKUP(B82,Entries!$A:$D,4,0),\"-\")","v":"-"},{"$f":"IFERROR(VLOOKUP(B82,Entries!$A:$H,8,0),\"-\")","v":"-"},{"$f":"IFERROR(VLOOKUP(B82,Entries!$A:$F,6,0),\"-\")","v":"-"},null,null,6,null,{"$f":"IFERROR(VLOOKUP(J82,Entries!$A:$E,5,0),\"-\")","v":"-"},{"$f":"IFERROR(VLOOKUP(J82,Entries!$A:$D,4,0),\"-\")","v":"-"},{"$f":"IFERROR(VLOOKUP(J82,Entries!$A:$H,8,0),\"-\")","v":"-"},{"$f":"IFERROR(VLOOKUP(J82,Entries!$A:$F,6,0),\"-\")","v":"-"}]
[7,null,{"$f":"IFERROR(VLOOKUP(B83,Entries!$A:$E,5,0),\"-\")","v":"-"},{"$f":"IFERROR(VLOOKUP(B83,Entries!$A:$D,4,0),\"-\")","v":"-"},{"$f":"IFERROR(VLOOKUP(B83,Entries!$A:$H,8,0),\"-\")","v":"-"},{"$f":"IFERROR(VLOOKUP(B83,Entries!$A:$F,6,0),\"-\")","v":"-"},null,null,7,null,{"$f":"IFERROR(VLOOKUP(J83,Entries!$A:$E,5,0),\"-\")","v":"-"},{"$f":"IFERROR(VLOOKUP(J83,Entries!$A:$D,4,0),\"-\")","v":"-"},{"$f":"IFERROR(VLOOKUP(J83,Entries!$A:$H,8,0),\"-\")","v":"-"},{"$f":"IFERROR(VLOOKUP(J83,Entries!$A:$F,6,0),\"-\")","v":"-"}]
[8,null,{"$f":"IFERROR(VLOOKUP(B84,Entries!$A:$E,5,0),\"-\")","v":"-"},{"$f":"IFERROR(VLOOKUP(B84,Entries!$A:$D,4,0),\"-\")","v":"-"},{"$f":"IFERROR(VLOOKUP(B84,Entries!$A:$H,8,0),\"-\")","v":"-"},{"$f":"IFERROR(VLOOKUP(B84,Entries!$A:$F,6,0),\"-\")","v":"-"},null,null,8,null,{"$f":"IFERROR(VLOOKUP(J84,Entries!$A:$E,5,0),\"-\")","v":"-"},{"$f":"IFERROR(VLOOKUP(J84,Entries!$A:$D,4,0),\"-\")","v":"-"},{"$f":"IFERROR(VLOOKUP(J84,Entries!$A:$H,8,0),\"-\")","v":"-"},{"$f":"IFERROR(VLOOKUP(J84,Entries!$A:$F,6,0),\"-\")","v":"-"}]
[]
[]
["U20 Men",null,null,null,null,"Wind",null,null,"Senior Women",null,null,null,null,"Wind"]
["Pos","Number","Last Name","First Name","Age","Club","Time",null,"Pos","Number","Last Name","First Name","Age","Club","Time"]
[1,14,{"$f":"IFERROR(VLOOKUP(B89,Entries!$A:$E,5,0),\"-\")","v":"Ekerin"},{"$f":"IFERROR(VLOOKUP(B89,Entries!$A:$D,4,0),\"-\")","v":"Tobi"},{"$f":"IFERROR(VLOOKUP(B89,Entries!$A:$H,8,0),\"-\")","v":18},{"$f":"IFERROR(VLOOKUP(B89,Entries!$A:$F,6,0),\"-\")","v":"Basildon AC"},"11.63",null,1,128,{"$f":"IFERROR(VLOOKUP(J89,Entries!$A:$E,5,0),\"-\")","v":"Staines"},{"$f":"IFERROR(VLOOKUP(J89,Entries!$A:$D,4,0),\"-\")","v":"Victoria"},{"$f":"IFERROR(VLOOKUP(J89,Entries!$A:$H,8,0),\"-\")","v":27},{"$f":"IFERROR(VLOOKUP(J89,Entries!$A:$F,6,0),\"-\")","v":"City of Southend On Sea AC"},"13.87"]
[2,371,{"$f":"IFERROR(VLOOKUP(B90,Entries!$A:$E,5,0),\"-\")","v":"Okenla"},{"$f":"IFERROR(VLOOKUP(B90,Entries!$A:$D,4,0),\"-\")","v":"Kinyo"},{"$f":"IFERROR(VLOOKUP(B90,Entries!$A:$H,8,0),\"-\")","v":17},{"$f":"IFERROR(VLOOKUP(B90,Entries!$A:$F,6,0),\"-\")","v":"Basildon AC"},"12.40",null,2,231,{"$f":"IFERROR(VLOOKUP(J90,Entries!$A:$E,5,0),\"-\")","v":"Hopper"},{"$f":"IFERROR(VLOOKUP(J90,Entries!$A:$D,4,0),\"-\")","v":"Laura"},{"$f":"IFERROR(VLOOKUP(J90,Entries!$A:$H,8,0),\"-\")","v":23},{"$f":"IFERROR(VLOOKUP(J90,Entries!$A:$F,6,0),\"-\")","v":"London City Runners"},"16.48"]
[3,null,{"$f":"IFERROR(VLOOKUP(B91,Entries!$A:$E,5,0),\"-\")","v":"-"},{"$f":"IFERROR(VLOOKUP(B91,Entries!$A:$D,4,0),\"-\")","v":"-"},{"$f":"IFERROR(VLOOKUP(B91,Entries!$A:$H,8,0),\"-\")","v":"-"},{"$f":"IFERROR(VLOOKUP(B91,Entries!$A:$F,6,0),\"-\")","v":"-"},null,null,3,null,{"$f":"IFERROR(VLOOKUP(J91,Entries!$A:$E,5,0),\"-\")","v":"-"},{"$f":"IFERROR(VLOOKUP(J91,Entries!$A:$D,4,0),\"-\")","v":"-"},{"$f":"IFERROR(VLOOKUP(J91,Entries!$A:$H,8,0),\"-\")","v":"-"},{"$f":"IFERROR(VLOOKUP(J91,Entries!$A:$F,6,0),\"-\")","v":"-"}]
[4,null,{"$f":"IFERROR(VLOOKUP(B92,Entries!$A:$E,5,0),\"-\")","v":"-"},{"$f":"IFERROR(VLOOKUP(B92,Entries!$A:$D,4,0),\"-\")","v":"-"},{"$f":"IFERROR(VLOOKUP(B92,Entries!$A:$H,8,0),\"-\")","v":"-"},{"$f":"IFERROR(VLOOKUP(B92,Entries!$A:$F,6,0),\"-\")","v":"-"},null,null,4,null,{"$f":"IFERROR(VLOOKUP(J92,Entries!$A:$E,5,0),\"-\")","v":"-"},{"$f":"IFERROR(VLOOKUP(J92,Entries!$A:$D,4,0),\"-\")","v":"-"},{"$f":"IFERROR(VLOOKUP(J92,Entries!$A:$H,8,0),\"-\")","v":"-"},{"$f":"IFERROR(VLOOKUP(J92,Entries!$A:$F,6,0),\"-\")","v":"-"}]
[5,null,{"$f":"IFERROR(VLOOKUP(B93,Entries!$A:$E,5,0),\"-\")","v":"-"},{"$f":"IFERROR(VLOOKUP(B93,Entries!$A:$D,4,0),\"-\")","v":"-"},{"$f":"IFERROR(VLOOKUP(B93,Entries!$A:$H,8,0),\"-\")","v":"-"},{"$f":"IFERROR(VLOOKUP(B93,Entries!$A:$F,6,0),\"-\")","v":"-"},null,null,5,null,{"$f":"IFERROR(VLOOKUP(J93,Entries!$A:$E,5,0),\"-\")","v":"-"},{"$f":"IFERROR(VLOOKUP(J93,Entries!$A:$D,4,0),\"-\")","v":"-"},{"$f":"IFERROR(VLOOKUP(J93,Entries!$A:$H,8,0),\"-\")","v":"-"},{"$f":"IFERROR(VLOOKUP(J93,Entries!$A:$F,6,0),\"-\")","v":"-"}]
[6,null,{"$f":"IFERROR(VLOOKUP(B94,Entries!$A:$E,5,0),\"-\")","v":"-"},{"$f":"IFERROR(VLOOKUP(B94,Entries!$A:$D,4,0),\"-\")","v":"-"},{"$f":"IFERROR(VLOOKUP(B94,Entries!$A:$H,8,0),\"-\")","v":"-"},{"$f":"IFERROR(VLOOKUP(B94,Entries!$A:$F,6,0),\"-\")","v":"-"},null,null,6,null,{"$f":"IFERROR(VLOOKUP(J94,Entries!$A:$E,5,0),\"-\")","v":"-"},{"$f":"IFERROR(VLOOKUP(J94,Entries!$A:$D,4,0),\"-\")","v":"-"},{"$f":"IFERROR(VLOOKUP(J94,Entries!$A:$H,8,0),\"-\")","v":"-"},{"$f":"IFERROR(VLOOKUP(J94,Entries!$A:$F,6,0),\"-\")","v":"-"}]
[7,null,{"$f":"IFERROR(VLOOKUP(B95,Entries!$A:$E,5,0),\"-\")","v":"-"},{"$f":"IFERROR(VLOOKUP(B95,Entries!$A:$D,4,0),\"-\")","v":"-"},{"$f":"IFERROR(VLOOKUP(B95,Entries!$A:$H,8,0),\"-\")","v":"-"},{"$f":"IFERROR(VLOOKUP(B95,Entries!$A:$F,6,0),\"-\")","v":"-"},null,null,7,null,{"$f":"IFERROR(VLOOKUP(J95,Entries!$A:$E,5,0),\"-\")","v":"-"},{"$f":"IFERROR(VLOOKUP(J95,Entries!$A:$D,4,0),\"-\")","v":"-"},{"$f":"IFERROR(VLOOKUP(J95,Entries!$A:$H,8,0),\"-\")","v":"-"},{"$f":"IFERROR(VLOOKUP(J95,Entries!$A:$F,6,0),\"-\")","v":"-"}]
[8,null,{"$f":"IFERROR(VLOOKUP(B96,Entries!$A:$E,5,0),\"-\")","v":"-"},{"$f":"IFERROR(VLOOKUP(B96,Entries!$A:$D,4,0),\"-\")","v":"-"},{"$f":"IFERROR(VLOOKUP(B96,Entries!$A:$H,8,0),\"-\")","v":"-"},{"$f":"IFERROR(VLOOKUP(B96,Entries!$A:$F,6,0),\"-\")","v":"-"},null,null,8,null,{"$f":"IFERROR(VLOOKUP(J96,Entries!$A:$E,5,0),\"-\")","v":"-"},{"$f":"IFERROR(VLOOKUP(J96,Entries!$A:$D,4,0),\"-\")","v":"-"},{"$f":"IFERROR(VLOOKUP(J96,Entries!$A:$H,8,0),\"-\")","v":"-"},{"$f":"IFERROR(VLOOKUP(J96,Entries!$A:$F,6,0),\"-\")","v":"-"}]
[]
[]
["Senior Men",null,null,null,null,"Wind",null,null,"Veteran Women",null,null,null,null,"Wind"]
["Pos","Number","Last Name","First Name","Age","Club","Time",null,"Pos","Number","Last Name","First Name","Age","Club","Time"]
[1,342,{"$f":"IFERROR(VLOOKUP(B101,Entries!$A:$E,5,0),\"-\")","v":"Berrett"},{"$f":"IFERROR(VLOOKUP(B101,Entries!$A:$D,4,0),\"-\")","v":"Louis"},{"$f":"IFERROR(VLOOKUP(B101,Entries!$A:$H,8,0),\"-\")","v":22},{"$f":"IFERROR(VLOOKUP(B101,Entries!$A:$F,6,0),\"-\")","v":"Havering AC"},"12.19",null,1,352,{"$f":"IFERROR(VLOOKUP(J101,Entries!$A:$E,5,0),\"-\")","v":"Hill"},{"$f":"IFERROR(VLOOKUP(J101,Entries!$A:$D,4,0),\"-\")","v":"Deborah"},{"$f":"IFERROR(VLOOKUP(J101,Entries!$A:$H,8,0),\"-\")","v":53},{"$f":"IFERROR(VLOOKUP(J101,Entries!$A:$F,6,0),\"-\")","v":"Fordy Runs Running Club"},"16.85"]
[2,null,{"$f":"IFERROR(VLOOKUP(B102,Entries!$A:$E,5,0),\"-\")","v":"-"},{"$f":"IFERROR(VLOOKUP(B102,Entries!$A:$D,4,0),\"-\")","v":"-"},{"$f":"IFERROR(VLOOKUP(B102,Entries!$A:$H,8,0),\"-\")","v":"-"},{"$f":"IFERROR(VLOOKUP(B102,Entries!$A:$F,6,0),\"-\")","v":"-"},null,null,2,345,{"$f":"IFERROR(VLOOKUP(J102,Entries!$A:$E,5,0),\"-\")","v":"Donnelly"},{"$f":"IFERROR(VLOOKUP(J102,Entries!$A:$D,4,0),\"-\")","v":"Linda"},{"$f":"IFERROR(VLOOKUP(J102,Entries!$A:$H,8,0),\"-\")","v":66},{"$f":"IFERROR(VLOOKUP(J102,Entries!$A:$F,6,0),\"-\")","v":"City of Southend On Sea AC"},"20.50"]
[3,null,{"$f":"IFERROR(VLOOKUP(B103,Entries!$A:$E,5,0),\"-\")","v":"-"},{"$f":"IFERROR(VLOOKUP(B103,Entries!$A:$D,4,0),\"-\")","v":"-"},{"$f":"IFERROR(VLOOKUP(B103,Entries!$A:$H,8,0),\"-\")","v":"-"},{"$f":"IFERROR(VLOOKUP(B103,Entries!$A:$F,6,0),\"-\")","v":"-"},null,null,3,295,{"$f":"IFERROR(VLOOKUP(J103,Entries!$A:$E,5,0),\"-\")","v":"Matthews-Smith"},{"$f":"IFERROR(VLOOKUP(J103,Entries!$A:$D,4,0),\"-\")","v":"Marion"},{"$f":"IFERROR(VLOOKUP(J103,Entries!$A:$H,8,0),\"-\")","v":69},{"$f":"IFERROR(VLOOKUP(J103,Entries!$A:$F,6,0),\"-\")","v":"City of Southend On Sea AC"},"23.01"]
[4,null,{"$f":"IFERROR(VLOOKUP(B104,Entries!$A:$E,5,0),\"-\")","v":"-"},{"$f":"IFERROR(VLOOKUP(B104,Entries!$A:$D,4,0),\"-\")","v":"-"},{"$f":"IFERROR(VLOOKUP(B104,Entries!$A:$H,8,0),\"-\")","v":"-"},{"$f":"IFERROR(VLOOKUP(B104,Entries!$A:$F,6,0),\"-\")","v":"-"},null,null,4,null,{"$f":"IFERROR(VLOOKUP(J104,Entries!$A:$E,5,0),\"-\")","v":"-"},{"$f":"IFERROR(VLOOKUP(J104,Entries!$A:$D,4,0),\"-\")","v":"-"},{"$f":"IFERROR(VLOOKUP(J104,Entries!$A:$H,8,0),\"-\")","v":"-"},{"$f":"IFERROR(VLOOKUP(J104,Entries!$A:$F,6,0),\"-\")","v":"-"}]
[5,null,{"$f":"IFERROR(VLOOKUP(B105,Entries!$A:$E,5,0),\"-\")","v":"-"},{"$f":"IFERROR(VLOOKUP(B105,Entries!$A:$D,4,0),\"-\")","v":"-"},{"$f":"IFERROR(VLOOKUP(B105,Entries!$A:$H,8,0),\"-\")","v":"-"},{"$f":"IFERROR(VLOOKUP(B105,Entries!$A:$F,6,0),\"-\")","v":"-"},null,null,5,null,{"$f":"IFERROR(VLOOKUP(J105,Entries!$A:$E,5,0),\"-\")","v":"-"},{"$f":"IFERROR(VLOOKUP(J105,Entries!$A:$D,4,0),\"-\")","v":"-"},{"$f":"IFERROR(VLOOKUP(J105,Entries!$A:$H,8,0),\"-\")","v":"-"},{"$f":"IFERROR(VLOOKUP(J105,Entries!$A:$F,6,0),\"-\")","v":"-"}]
[6,null,{"$f":"IFERROR(VLOOKUP(B106,Entries!$A:$E,5,0),\"-\")","v":"-"},{"$f":"IFERROR(VLOOKUP(B106,Entries!$A:$D,4,0),\"-\")","v":"-"},{"$f":"IFERROR(VLOOKUP(B106,Entries!$A:$H,8,0),\"-\")","v":"-"},{"$f":"IFERROR(VLOOKUP(B106,Entries!$A:$F,6,0),\"-\")","v":"-"},null,null,6,null,{"$f":"IFERROR(VLOOKUP(J106,Entries!$A:$E,5,0),\"-\")","v":"-"},{"$f":"IFERROR(VLOOKUP(J106,Entries!$A:$D,4,0),\"-\")","v":"-"},{"$f":"IFERROR(VLOOKUP(J106,Entries!$A:$H,8,0),\"-\")","v":"-"},{"$f":"IFERROR(VLOOKUP(J106,Entries!$A:$F,6,0),\"-\")","v":"-"}]
[7,null,{"$f":"IFERROR(VLOOKUP(B107,Entries!$A:$E,5,0),\"-\")","v":"-"},{"$f":"IFERROR(VLOOKUP(B107,Entries!$A:$D,4,0),\"-\")","v":"-"},{"$f":"IFERROR(VLOOKUP(B107,Entries!$A:$H,8,0),\"-\")","v":"-"},{"$f":"IFERROR(VLOOKUP(B107,Entries!$A:$F,6,0),\"-\")","v":"-"},null,null,7,null,{"$f":"IFERROR(VLOOKUP(J107,Entries!$A:$E,5,0),\"-\")","v":"-"},{"$f":"IFERROR(VLOOKUP(J107,Entries!$A:$D,4,0),\"-\")","v":"-"},{"$f":"IFERROR(VLOOKUP(J107,Entries!$A:$H,8,0),\"-\")","v":"-"},{"$f":"IFERROR(VLOOKUP(J107,Entries!$A:$F,6,0),\"-\")","v":"-"}]
[8,null,{"$f":"IFERROR(VLOOKUP(B108,Entries!$A:$E,5,0),\"-\")","v":"-"},{"$f":"IFERROR(VLOOKUP(B108,Entries!$A:$D,4,0),\"-\")","v":"-"},{"$f":"IFERROR(VLOOKUP(B108,Entries!$A:$H,8,0),\"-\")","v":"-"},{"$f":"IFERROR(VLOOKUP(B108,Entries!$A:$F,6,0),\"-\")","v":"-"},null,null,8,null,{"$f":"IFERROR(VLOOKUP(J108,Entries!$A:$E,5,0),\"-\")","v":"-"},{"$f":"IFERROR(VLOOKUP(J108,Entries!$A:$D,4,0),\"-\")","v":"-"},{"$f":"IFERROR(VLOOKUP(J108,Entries!$A:$H,8,0),\"-\")","v":"-"},{"$f":"IFERROR(VLOOKUP(J108,Entries!$A:$F,6,0),\"-\")","v":"-"}]
[]
[]
["Veteran Men",null,null,null,null,"Wind",-5.2]
["Pos","Number","Last Name","First Name","Age","Club","Time"]
[1,146,{"$f":"IFERROR(VLOOKUP(B113,Entries!$A:$E,5,0),\"-\")","v":"Carter"},{"$f":"IFERROR(VLOOKUP(B113,Entries!$A:$D,4,0),\"-\")","v":"Stuart"},{"$f":"IFERROR(VLOOKUP(B113,Entries!$A:$H,8,0),\"-\")","v":50},{"$f":"IFERROR(VLOOKUP(B113,Entries!$A:$F,6,0),\"-\")","v":"Brentwood Beagles Athletics Club"},"13.35"]
[2,113,{"$f":"IFERROR(VLOOKUP(B114,Entries!$A:$E,5,0),\"-\")","v":"Browne"},{"$f":"IFERROR(VLOOKUP(B114,Entries!$A:$D,4,0),\"-\")","v":"Dr John"},{"$f":"IFERROR(VLOOKUP(B114,Entries!$A:$H,8,0),\"-\")","v":71},{"$f":"IFERROR(VLOOKUP(B114,Entries!$A:$F,6,0),\"-\")","v":"Marshall Milton Keynes AC"},"14.02"]
[3,209,{"$f":"IFERROR(VLOOKUP(B115,Entries!$A:$E,5,0),\"-\")","v":"William"},{"$f":"IFERROR(VLOOKUP(B115,Entries!$A:$D,4,0),\"-\")","v":"Bernard"},{"$f":"IFERROR(VLOOKUP(B115,Entries!$A:$H,8,0),\"-\")","v":35},{"$f":"IFERROR(VLOOKUP(B115,Entries!$A:$F,6,0),\"-\")","v":"JBR Run and Tri Club"},"14.27"]
[4,null,{"$f":"IFERROR(VLOOKUP(B116,Entries!$A:$E,5,0),\"-\")","v":"-"},{"$f":"IFERROR(VLOOKUP(B116,Entries!$A:$D,4,0),\"-\")","v":"-"},{"$f":"IFERROR(VLOOKUP(B116,Entries!$A:$H,8,0),\"-\")","v":"-"},{"$f":"IFERROR(VLOOKUP(B116,Entries!$A:$F,6,0),\"-\")","v":"-"}]
[5,null,{"$f":"IFERROR(VLOOKUP(B117,Entries!$A:$E,5,0),\"-\")","v":"-"},{"$f":"IFERROR(VLOOKUP(B117,Entries!$A:$D,4,0),\"-\")","v":"-"},{"$f":"IFERROR(VLOOKUP(B117,Entries!$A:$H,8,0),\"-\")","v":"-"},{"$f":"IFERROR(VLOOKUP(B117,Entries!$A:$F,6,0),\"-\")","v":"-"}]
[6,null,{"$f":"IFERROR(VLOOKUP(B118,Entries!$A:$E,5,0),\"-\")","v":"-"},{"$f":"IFERROR(VLOOKUP(B118,Entries!$A:$D,4,0),\"-\")","v":"-"},{"$f":"IFERROR(VLOOKUP(B118,Entries!$A:$H,8,0),\"-\")","v":"-"},{"$f":"IFERROR(VLOOKUP(B118,Entries!$A:$F,6,0),\"-\")","v":"-"}]
[7,null,{"$f":"IFERROR(VLOOKUP(B119,Entries!$A:$E,5,0),\"-\")","v":"-"},{"$f":"IFERROR(VLOOKUP(B119,Entries!$A:$D,4,0),\"-\")","v":"-"},{"$f":"IFERROR(VLOOKUP(B119,Entries!$A:$H,8,0),\"-\")","v":"-"},{"$f":"IFERROR(VLOOKUP(B119,Entries!$A:$F,6,0),\"-\")","v":"-"}]
[8,null,{"$f":"IFERROR(VLOOKUP(B120,Entries!$A:$E,5,0),\"-\")","v":"-"},{"$f":"IFERROR(VLOOKUP(B120,Entries!$A:$D,4,0),\"-\")","v":"-"},{"$f":"IFERROR(VLOOKUP(B120,Entries!$A:$H,8,0),\"-\")","v":"-"},{"$f":"IFERROR(VLOOKUP(B120,Entries!$A:$F,6,0),\"-\")","v":"-"}]

{"sheet":"120m","index":6,"n_rows":12,"n_cols":15,"rows_kept":12,"cut":false,"hidden":false,"merged":[]}
["120m"]
[]
["U9 Boys Heat 1",null,null,null,null,"Wind",null,null,"U9 Girls Heat 1",null,null,null,null,"Wind"]
["Pos","Number","Last Name","First Name","Age","Club","Time",null,"Pos","Number","Last Name","First Name","Age","Club","Time"]
[1,7,{"$f":"IFERROR(VLOOKUP(B5,Entries!$A:$E,5,0),\"-\")","v":"Ngala"},{"$f":"IFERROR(VLOOKUP(B5,Entries!$A:$D,4,0),\"-\")","v":"Mya"},{"$f":"IFERROR(VLOOKUP(B5,Entries!$A:$H,8,0),\"-\")","v":7},{"$f":"IFERROR(VLOOKUP(B5,Entries!$A:$F,6,0),\"-\")","v":"Brentwood Beagles Athletics Club"},"15.49.48.15",null,1,156,{"$f":"IFERROR(VLOOKUP(J5,Entries!$A:$E,5,0),\"-\")","v":"Rayner"},{"$f":"IFERROR(VLOOKUP(J5,Entries!$A:$D,4,0),\"-\")","v":"Frankie"},{"$f":"IFERROR(VLOOKUP(J5,Entries!$A:$H,8,0),\"-\")","v":8},{"$f":"IFERROR(VLOOKUP(J5,Entries!$A:$F,6,0),\"-\")","v":"Herts Phoenix AC"},"15.43.21"]
[2,313,{"$f":"IFERROR(VLOOKUP(B6,Entries!$A:$E,5,0),\"-\")","v":"Vaughan"},{"$f":"IFERROR(VLOOKUP(B6,Entries!$A:$D,4,0),\"-\")","v":"Brody"},{"$f":"IFERROR(VLOOKUP(B6,Entries!$A:$H,8,0),\"-\")","v":7},{"$f":"IFERROR(VLOOKUP(B6,Entries!$A:$F,6,0),\"-\")","v":"SS Athletics"},"15.49.48.67",null,2,363,{"$f":"IFERROR(VLOOKUP(J6,Entries!$A:$E,5,0),\"-\")","v":"Gosling"},{"$f":"IFERROR(VLOOKUP(J6,Entries!$A:$D,4,0),\"-\")","v":"Elise"},{"$f":"IFERROR(VLOOKUP(J6,Entries!$A:$H,8,0),\"-\")","v":8},{"$f":"IFERROR(VLOOKUP(J6,Entries!$A:$F,6,0),\"-\")","v":"Brentwood Beagles Athletics Club"},"15.43.22"]
[3,258,{"$f":"IFERROR(VLOOKUP(B7,Entries!$A:$E,5,0),\"-\")","v":"Cain"},{"$f":"IFERROR(VLOOKUP(B7,Entries!$A:$D,4,0),\"-\")","v":"George"},{"$f":"IFERROR(VLOOKUP(B7,Entries!$A:$H,8,0),\"-\")","v":8},{"$f":"IFERROR(VLOOKUP(B7,Entries!$A:$F,6,0),\"-\")","v":"City of Southend On Sea AC"},"15.49.48.70",null,3,69,{"$f":"IFERROR(VLOOKUP(J7,Entries!$A:$E,5,0),\"-\")","v":"Adenodi"},{"$f":"IFERROR(VLOOKUP(J7,Entries!$A:$D,4,0),\"-\")","v":"Esther"},{"$f":"IFERROR(VLOOKUP(J7,Entries!$A:$H,8,0),\"-\")","v":8},{"$f":"IFERROR(VLOOKUP(J7,Entries!$A:$F,6,0),\"-\")","v":"SS Athletics"},"15.43.23.48"]
[4,242,{"$f":"IFERROR(VLOOKUP(B8,Entries!$A:$E,5,0),\"-\")","v":"Khan"},{"$f":"IFERROR(VLOOKUP(B8,Entries!$A:$D,4,0),\"-\")","v":"Muhammad "},{"$f":"IFERROR(VLOOKUP(B8,Entries!$A:$H,8,0),\"-\")","v":8},{"$f":"IFERROR(VLOOKUP(B8,Entries!$A:$F,6,0),\"-\")","v":"City of Southend On Sea AC"},"15.49.49",null,4,50,{"$f":"IFERROR(VLOOKUP(J8,Entries!$A:$E,5,0),\"-\")","v":"Nti-Jackson"},{"$f":"IFERROR(VLOOKUP(J8,Entries!$A:$D,4,0),\"-\")","v":"Serena"},{"$f":"IFERROR(VLOOKUP(J8,Entries!$A:$H,8,0),\"-\")","v":7},{"$f":"IFERROR(VLOOKUP(J8,Entries!$A:$F,6,0),\"-\")","v":"SS Athletics"},"15.43.23.80"]
[5,68,{"$f":"IFERROR(VLOOKUP(B9,Entries!$A:$E,5,0),\"-\")","v":"Adenodi"},{"$f":"IFERROR(VLOOKUP(B9,Entries!$A:$D,4,0),\"-\")","v":"Ethan"},{"$f":"IFERROR(VLOOKUP(B9,Entries!$A:$H,8,0),\"-\")","v":8},{"$f":"IFERROR(VLOOKUP(B9,Entries!$A:$F,6,0),\"-\")","v":"SS Athletics"},"15.49.52",null,5,365,{"$f":"IFERROR(VLOOKUP(J9,Entries!$A:$E,5,0),\"-\")","v":"Bridge"},{"$f":"IFERROR(VLOOKUP(J9,Entries!$A:$D,4,0),\"-\")","v":"Abriella"},{"$f":"IFERROR(VLOOKUP(J9,Entries!$A:$H,8,0),\"-\")","v":8},{"$f":"IFERROR(VLOOKUP(J9,Entries!$A:$F,6,0),\"-\")","v":"City of Southend On Sea AC"},"15.43.24"]
[6,245,{"$f":"IFERROR(VLOOKUP(B10,Entries!$A:$E,5,0),\"-\")","v":"Nedkov"},{"$f":"IFERROR(VLOOKUP(B10,Entries!$A:$D,4,0),\"-\")","v":"Robbie"},{"$f":"IFERROR(VLOOKUP(B10,Entries!$A:$H,8,0),\"-\")","v":7},{"$f":"IFERROR(VLOOKUP(B10,Entries!$A:$F,6,0),\"-\")","v":"Unattached"},"15.49.53.75",null,6,221,{"$f":"IFERROR(VLOOKUP(J10,Entries!$A:$E,5,0),\"-\")","v":"Grimes"},{"$f":"IFERROR(VLOOKUP(J10,Entries!$A:$D,4,0),\"-\")","v":"Penelope"},{"$f":"IFERROR(VLOOKUP(J10,Entries!$A:$H,8,0),\"-\")","v":7},{"$f":"IFERROR(VLOOKUP(J10,Entries!$A:$F,6,0),\"-\")","v":"SS Athletics"},"15.43.27"]
[7,167,{"$f":"IFERROR(VLOOKUP(B11,Entries!$A:$E,5,0),\"-\")","v":"Njogu"},{"$f":"IFERROR(VLOOKUP(B11,Entries!$A:$D,4,0),\"-\")","v":"Geoffrey"},{"$f":"IFERROR(VLOOKUP(B11,Entries!$A:$H,8,0),\"-\")","v":7},{"$f":"IFERROR(VLOOKUP(B11,Entries!$A:$F,6,0),\"-\")","v":"Unattached"},"15.49.53.75",null,7,224,{"$f":"IFERROR(VLOOKUP(J11,Entries!$A:$E,5,0),\"-\")","v":"Emery"},{"$f":"IFERROR(VLOOKUP(J11,Entries!$A:$D,4,0),\"-\")","v":"Eden"},{"$f":"IFERROR(VLOOKUP(J11,Entries!$A:$H,8,0),\"-\")","v":7},{"$f":"IFERROR(VLOOKUP(J11,Entries!$A:$F,6,0),\"-\")","v":"Unattached"},"15.43.28.81"]
[8,null,{"$f":"IFERROR(VLOOKUP(B12,Entries!$A:$E,5,0),\"-\")","v":"-"},{"$f":"IFERROR(VLOOKUP(B12,Entries!$A:$D,4,0),\"-\")","v":"-"},{"$f":"IFERROR(VLOOKUP(B12,Entries!$A:$H,8,0),\"-\")","v":"-"},{"$f":"IFERROR(VLOOKUP(B12,Entries!$A:$F,6,0),\"-\")","v":"-"},null,null,8,334,{"$f":"IFERROR(VLOOKUP(J12,Entries!$A:$E,5,0),\"-\")","v":"Frisby-Bright"},{"$f":"IFERROR(VLOOKUP(J12,Entries!$A:$D,4,0),\"-\")","v":"Amalie"},{"$f":"IFERROR(VLOOKUP(J12,Entries!$A:$H,8,0),\"-\")","v":8},{"$f":"IFERROR(VLOOKUP(J12,Entries!$A:$F,6,0),\"-\")","v":"Haverhill Running Club"},"15.43.28.90"]

{"sheet":"150m","index":7,"n_rows":48,"n_cols":15,"rows_kept":48,"cut":false,"hidden":false,"merged":[]}
["150m","U11 Year 3,4 & 5"]
[]
["U11 Boys Heat 1",null,null,null,null,"Wind",null,null,"U11 Girls Heat 1",null,null,null,null,"Wind"]
["Pos","Number","Last Name","First Name","Age","Club","Time",null,"Pos","Number","Last Name","First Name","Age","Club","Time"]
[1,162,{"$f":"IFERROR(VLOOKUP(B5,Entries!$A:$E,5,0),\"-\")","v":"Birnie"},{"$f":"IFERROR(VLOOKUP(B5,Entries!$A:$D,4,0),\"-\")","v":"Jack"},{"$f":"IFERROR(VLOOKUP(B5,Entries!$A:$H,8,0),\"-\")","v":9},{"$f":"IFERROR(VLOOKUP(B5,Entries!$A:$F,6,0),\"-\")","v":"Benfleet RC"},"24.97",null,1,166,{"$f":"IFERROR(VLOOKUP(J5,Entries!$A:$E,5,0),\"-\")","v":"Njogu"},{"$f":"IFERROR(VLOOKUP(J5,Entries!$A:$D,4,0),\"-\")","v":"Keziah"},{"$f":"IFERROR(VLOOKUP(J5,Entries!$A:$H,8,0),\"-\")","v":9},{"$f":"IFERROR(VLOOKUP(J5,Entries!$A:$F,6,0),\"-\")","v":"SS Athletics"},"25.98"]
[2,168,{"$f":"IFERROR(VLOOKUP(B6,Entries!$A:$E,5,0),\"-\")","v":"Blomfield"},{"$f":"IFERROR(VLOOKUP(B6,Entries!$A:$D,4,0),\"-\")","v":"Jack"},{"$f":"IFERROR(VLOOKUP(B6,Entries!$A:$H,8,0),\"-\")","v":9},{"$f":"IFERROR(VLOOKUP(B6,Entries!$A:$F,6,0),\"-\")","v":"SS Athletics"},"25.50",null,2,134,{"$f":"IFERROR(VLOOKUP(J6,Entries!$A:$E,5,0),\"-\")","v":"Perry"},{"$f":"IFERROR(VLOOKUP(J6,Entries!$A:$D,4,0),\"-\")","v":"Elsie"},{"$f":"IFERROR(VLOOKUP(J6,Entries!$A:$H,8,0),\"-\")","v":9},{"$f":"IFERROR(VLOOKUP(J6,Entries!$A:$F,6,0),\"-\")","v":"SS Athletics"},"26.25"]
[3,257,{"$f":"IFERROR(VLOOKUP(B7,Entries!$A:$E,5,0),\"-\")","v":"Radley"},{"$f":"IFERROR(VLOOKUP(B7,Entries!$A:$D,4,0),\"-\")","v":"Lenny"},{"$f":"IFERROR(VLOOKUP(B7,Entries!$A:$H,8,0),\"-\")","v":9},{"$f":"IFERROR(VLOOKUP(B7,Entries!$A:$F,6,0),\"-\")","v":"Unattached"},"25.74",null,3,104,{"$f":"IFERROR(VLOOKUP(J7,Entries!$A:$E,5,0),\"-\")","v":"Townsend"},{"$f":"IFERROR(VLOOKUP(J7,Entries!$A:$D,4,0),\"-\")","v":"Kirsten"},{"$f":"IFERROR(VLOOKUP(J7,Entries!$A:$H,8,0),\"-\")","v":9},{"$f":"IFERROR(VLOOKUP(J7,Entries!$A:$F,6,0),\"-\")","v":"Colchester & Tendring AC"},"27.75"]
[4,144,{"$f":"IFERROR(VLOOKUP(B8,Entries!$A:$E,5,0),\"-\")","v":"Massey"},{"$f":"IFERROR(VLOOKUP(B8,Entries!$A:$D,4,0),\"-\")","v":"Angelo"},{"$f":"IFERROR(VLOOKUP(B8,Entries!$A:$H,8,0),\"-\")","v":9},{"$f":"IFERROR(VLOOKUP(B8,Entries!$A:$F,6,0),\"-\")","v":"Unattached"},"26.17",null,4,220,{"$f":"IFERROR(VLOOKUP(J8,Entries!$A:$E,5,0),\"-\")","v":"Grimes"},{"$f":"IFERROR(VLOOKUP(J8,Entries!$A:$D,4,0),\"-\")","v":"Poppy"},{"$f":"IFERROR(VLOOKUP(J8,Entries!$A:$H,8,0),\"-\")","v":9},{"$f":"IFERROR(VLOOKUP(J8,Entries!$A:$F,6,0),\"-\")","v":"SS Athletics"},"28.03"]
[5,131,{"$f":"IFERROR(VLOOKUP(B9,Entries!$A:$E,5,0),\"-\")","v":"Fox"},{"$f":"IFERROR(VLOOKUP(B9,Entries!$A:$D,4,0),\"-\")","v":"Hari"},{"$f":"IFERROR(VLOOKUP(B9,Entries!$A:$H,8,0),\"-\")","v":9},{"$f":"IFERROR(VLOOKUP(B9,Entries!$A:$F,6,0),\"-\")","v":"Unattached"},"32.03",null,5,2,{"$f":"IFERROR(VLOOKUP(J9,Entries!$A:$E,5,0),\"-\")","v":"Awoyode"},{"$f":"IFERROR(VLOOKUP(J9,Entries!$A:$D,4,0),\"-\")","v":"Grace"},{"$f":"IFERROR(VLOOKUP(J9,Entries!$A:$H,8,0),\"-\")","v":9},{"$f":"IFERROR(VLOOKUP(J9,Entries!$A:$F,6,0),\"-\")","v":"Unattached"},"35.42"]
[6,null,{"$f":"IFERROR(VLOOKUP(B10,Entries!$A:$E,5,0),\"-\")","v":"-"},{"$f":"IFERROR(VLOOKUP(B10,Entries!$A:$D,4,0),\"-\")","v":"-"},{"$f":"IFERROR(VLOOKUP(B10,Entries!$A:$H,8,0),\"-\")","v":"-"},{"$f":"IFERROR(VLOOKUP(B10,Entries!$A:$F,6,0),\"-\")","v":"-"},null,null,6,null,{"$f":"IFERROR(VLOOKUP(J10,Entries!$A:$E,5,0),\"-\")","v":"-"},{"$f":"IFERROR(VLOOKUP(J10,Entries!$A:$D,4,0),\"-\")","v":"-"},{"$f":"IFERROR(VLOOKUP(J10,Entries!$A:$H,8,0),\"-\")","v":"-"},{"$f":"IFERROR(VLOOKUP(J10,Entries!$A:$F,6,0),\"-\")","v":"-"}]
[7,null,{"$f":"IFERROR(VLOOKUP(B11,Entries!$A:$E,5,0),\"-\")","v":"-"},{"$f":"IFERROR(VLOOKUP(B11,Entries!$A:$D,4,0),\"-\")","v":"-"},{"$f":"IFERROR(VLOOKUP(B11,Entries!$A:$H,8,0),\"-\")","v":"-"},{"$f":"IFERROR(VLOOKUP(B11,Entries!$A:$F,6,0),\"-\")","v":"-"},null,null,7,null,{"$f":"IFERROR(VLOOKUP(J11,Entries!$A:$E,5,0),\"-\")","v":"-"},{"$f":"IFERROR(VLOOKUP(J11,Entries!$A:$D,4,0),\"-\")","v":"-"},{"$f":"IFERROR(VLOOKUP(J11,Entries!$A:$H,8,0),\"-\")","v":"-"},{"$f":"IFERROR(VLOOKUP(J11,Entries!$A:$F,6,0),\"-\")","v":"-"}]
[8,null,{"$f":"IFERROR(VLOOKUP(B12,Entries!$A:$E,5,0),\"-\")","v":"-"},{"$f":"IFERROR(VLOOKUP(B12,Entries!$A:$D,4,0),\"-\")","v":"-"},{"$f":"IFERROR(VLOOKUP(B12,Entries!$A:$H,8,0),\"-\")","v":"-"},{"$f":"IFERROR(VLOOKUP(B12,Entries!$A:$F,6,0),\"-\")","v":"-"},null,null,8,null,{"$f":"IFERROR(VLOOKUP(J12,Entries!$A:$E,5,0),\"-\")","v":"-"},{"$f":"IFERROR(VLOOKUP(J12,Entries!$A:$D,4,0),\"-\")","v":"-"},{"$f":"IFERROR(VLOOKUP(J12,Entries!$A:$H,8,0),\"-\")","v":"-"},{"$f":"IFERROR(VLOOKUP(J12,Entries!$A:$F,6,0),\"-\")","v":"-"}]
[]
[]
["U11 Boys Heat 2",null,null,null,null,"Wind",-3.8,null,"U11 Girls Heat 2",null,null,null,null,"Wind"]
["Pos","Number","Last Name","First Name","Age","Club","Time",null,"Pos","Number","Last Name","First Name","Age","Club","Time"]
[1,304,{"$f":"IFERROR(VLOOKUP(B17,Entries!$A:$E,5,0),\"-\")","v":"Cole"},{"$f":"IFERROR(VLOOKUP(B17,Entries!$A:$D,4,0),\"-\")","v":"Tyatt"},{"$f":"IFERROR(VLOOKUP(B17,Entries!$A:$H,8,0),\"-\")","v":9},{"$f":"IFERROR(VLOOKUP(B17,Entries!$A:$F,6,0),\"-\")","v":"City of Southend On Sea AC"},"24.31",null,1,310,{"$f":"IFERROR(VLOOKUP(J17,Entries!$A:$E,5,0),\"-\")","v":"Lewis"},{"$f":"IFERROR(VLOOKUP(J17,Entries!$A:$D,4,0),\"-\")","v":"Emily"},{"$f":"IFERROR(VLOOKUP(J17,Entries!$A:$H,8,0),\"-\")","v":9},{"$f":"IFERROR(VLOOKUP(J17,Entries!$A:$F,6,0),\"-\")","v":"City of Southend On Sea AC"},"24.62"]
[2,314,{"$f":"IFERROR(VLOOKUP(B18,Entries!$A:$E,5,0),\"-\")","v":"Jackson"},{"$f":"IFERROR(VLOOKUP(B18,Entries!$A:$D,4,0),\"-\")","v":"Joshua"},{"$f":"IFERROR(VLOOKUP(B18,Entries!$A:$H,8,0),\"-\")","v":9},{"$f":"IFERROR(VLOOKUP(B18,Entries!$A:$F,6,0),\"-\")","v":"City of Southend-on-Sea Athletic Club"},"25.61",null,2,223,{"$f":"IFERROR(VLOOKUP(J18,Entries!$A:$E,5,0),\"-\")","v":"Emery"},{"$f":"IFERROR(VLOOKUP(J18,Entries!$A:$D,4,0),\"-\")","v":"Isla"},{"$f":"IFERROR(VLOOKUP(J18,Entries!$A:$H,8,0),\"-\")","v":9},{"$f":"IFERROR(VLOOKUP(J18,Entries!$A:$F,6,0),\"-\")","v":"Benfleet RC"},"26.04"]
[3,307,{"$f":"IFERROR(VLOOKUP(B19,Entries!$A:$E,5,0),\"-\")","v":"Balisson"},{"$f":"IFERROR(VLOOKUP(B19,Entries!$A:$D,4,0),\"-\")","v":"Nathan"},{"$f":"IFERROR(VLOOKUP(B19,Entries!$A:$H,8,0),\"-\")","v":9},{"$f":"IFERROR(VLOOKUP(B19,Entries!$A:$F,6,0),\"-\")","v":"City of Southend On Sea AC"},"26.40",null,3,328,{"$f":"IFERROR(VLOOKUP(J19,Entries!$A:$E,5,0),\"-\")","v":"Hallahan"},{"$f":"IFERROR(VLOOKUP(J19,Entries!$A:$D,4,0),\"-\")","v":"Orlaith"},{"$f":"IFERROR(VLOOKUP(J19,Entries!$A:$H,8,0),\"-\")","v":9},{"$f":"IFERROR(VLOOKUP(J19,Entries!$A:$F,6,0),\"-\")","v":"Unattached"},"26.11"]
[4,null,{"$f":"IFERROR(VLOOKUP(B20,Entries!$A:$E,5,0),\"-\")","v":"-"},{"$f":"IFERROR(VLOOKUP(B20,Entries!$A:$D,4,0),\"-\")","v":"-"},{"$f":"IFERROR(VLOOKUP(B20,Entries!$A:$H,8,0),\"-\")","v":"-"},{"$f":"IFERROR(VLOOKUP(B20,Entries!$A:$F,6,0),\"-\")","v":"-"},null,null,4,339,{"$f":"IFERROR(VLOOKUP(J20,Entries!$A:$E,5,0),\"-\")","v":"Williams"},{"$f":"IFERROR(VLOOKUP(J20,Entries!$A:$D,4,0),\"-\")","v":"Tilly"},{"$f":"IFERROR(VLOOKUP(J20,Entries!$A:$H,8,0),\"-\")","v":9},{"$f":"IFERROR(VLOOKUP(J20,Entries!$A:$F,6,0),\"-\")","v":"SS Athletics"},"26.13"]
[5,null,{"$f":"IFERROR(VLOOKUP(B21,Entries!$A:$E,5,0),\"-\")","v":"-"},{"$f":"IFERROR(VLOOKUP(B21,Entries!$A:$D,4,0),\"-\")","v":"-"},{"$f":"IFERROR(VLOOKUP(B21,Entries!$A:$H,8,0),\"-\")","v":"-"},{"$f":"IFERROR(VLOOKUP(B21,Entries!$A:$F,6,0),\"-\")","v":"-"},null,null,5,265,{"$f":"IFERROR(VLOOKUP(J21,Entries!$A:$E,5,0),\"-\")","v":"Hatt"},{"$f":"IFERROR(VLOOKUP(J21,Entries!$A:$D,4,0),\"-\")","v":"Jessica"},{"$f":"IFERROR(VLOOKUP(J21,Entries!$A:$H,8,0),\"-\")","v":9},{"$f":"IFERROR(VLOOKUP(J21,Entries!$A:$F,6,0),\"-\")","v":"SS Athletics"},"27.82"]
[6,null,{"$f":"IFERROR(VLOOKUP(B22,Entries!$A:$E,5,0),\"-\")","v":"-"},{"$f":"IFERROR(VLOOKUP(B22,Entries!$A:$D,4,0),\"-\")","v":"-"},{"$f":"IFERROR(VLOOKUP(B22,Entries!$A:$H,8,0),\"-\")","v":"-"},{"$f":"IFERROR(VLOOKUP(B22,Entries!$A:$F,6,0),\"-\")","v":"-"},null,null,6,null,{"$f":"IFERROR(VLOOKUP(J22,Entries!$A:$E,5,0),\"-\")","v":"-"},{"$f":"IFERROR(VLOOKUP(J22,Entries!$A:$D,4,0),\"-\")","v":"-"},{"$f":"IFERROR(VLOOKUP(J22,Entries!$A:$H,8,0),\"-\")","v":"-"},{"$f":"IFERROR(VLOOKUP(J22,Entries!$A:$F,6,0),\"-\")","v":"-"}]
[7,null,{"$f":"IFERROR(VLOOKUP(B23,Entries!$A:$E,5,0),\"-\")","v":"-"},{"$f":"IFERROR(VLOOKUP(B23,Entries!$A:$D,4,0),\"-\")","v":"-"},{"$f":"IFERROR(VLOOKUP(B23,Entries!$A:$H,8,0),\"-\")","v":"-"},{"$f":"IFERROR(VLOOKUP(B23,Entries!$A:$F,6,0),\"-\")","v":"-"},null,null,7,null,{"$f":"IFERROR(VLOOKUP(J23,Entries!$A:$E,5,0),\"-\")","v":"-"},{"$f":"IFERROR(VLOOKUP(J23,Entries!$A:$D,4,0),\"-\")","v":"-"},{"$f":"IFERROR(VLOOKUP(J23,Entries!$A:$H,8,0),\"-\")","v":"-"},{"$f":"IFERROR(VLOOKUP(J23,Entries!$A:$F,6,0),\"-\")","v":"-"}]
[8,null,{"$f":"IFERROR(VLOOKUP(B24,Entries!$A:$E,5,0),\"-\")","v":"-"},{"$f":"IFERROR(VLOOKUP(B24,Entries!$A:$D,4,0),\"-\")","v":"-"},{"$f":"IFERROR(VLOOKUP(B24,Entries!$A:$H,8,0),\"-\")","v":"-"},{"$f":"IFERROR(VLOOKUP(B24,Entries!$A:$F,6,0),\"-\")","v":"-"},null,null,8,null,{"$f":"IFERROR(VLOOKUP(J24,Entries!$A:$E,5,0),\"-\")","v":"-"},{"$f":"IFERROR(VLOOKUP(J24,Entries!$A:$D,4,0),\"-\")","v":"-"},{"$f":"IFERROR(VLOOKUP(J24,Entries!$A:$H,8,0),\"-\")","v":"-"},{"$f":"IFERROR(VLOOKUP(J24,Entries!$A:$F,6,0),\"-\")","v":"-"}]
[]
[]
["U11 Boys Heat 3",null,null,null,null,"Wind",null,null,"U11 Girls Heat 3",null,null,null,null,"Wind",-3.6]
["Pos","Number","Last Name","First Name","Age","Club","Time",null,"Pos","Number","Last Name","First Name","Age","Club","Time"]
[1,177,{"$f":"IFERROR(VLOOKUP(B29,Entries!$A:$E,5,0),\"-\")","v":"Connor"},{"$f":"IFERROR(VLOOKUP(B29,Entries!$A:$D,4,0),\"-\")","v":"Jax"},{"$f":"IFERROR(VLOOKUP(B29,Entries!$A:$H,8,0),\"-\")","v":10},{"$f":"IFERROR(VLOOKUP(B29,Entries!$A:$F,6,0),\"-\")","v":"Woodford Green AC with Essex Ladies"},"24.05",null,1,321,{"$f":"IFERROR(VLOOKUP(J29,Entries!$A:$E,5,0),\"-\")","v":"Rowles"},{"$f":"IFERROR(VLOOKUP(J29,Entries!$A:$D,4,0),\"-\")","v":"Clara"},{"$f":"IFERROR(VLOOKUP(J29,Entries!$A:$H,8,0),\"-\")","v":10},{"$f":"IFERROR(VLOOKUP(J29,Entries!$A:$F,6,0),\"-\")","v":"City of Southend On Sea AC"},"24.93"]
[2,93,{"$f":"IFERROR(VLOOKUP(B30,Entries!$A:$E,5,0),\"-\")","v":"Hollidge"},{"$f":"IFERROR(VLOOKUP(B30,Entries!$A:$D,4,0),\"-\")","v":"Eli"},{"$f":"IFERROR(VLOOKUP(B30,Entries!$A:$H,8,0),\"-\")","v":10},{"$f":"IFERROR(VLOOKUP(B30,Entries!$A:$F,6,0),\"-\")","v":"SS Athletics"},"25.21",null,2,66,{"$f":"IFERROR(VLOOKUP(J30,Entries!$A:$E,5,0),\"-\")","v":"Hay"},{"$f":"IFERROR(VLOOKUP(J30,Entries!$A:$D,4,0),\"-\")","v":"Bonnie"},{"$f":"IFERROR(VLOOKUP(J30,Entries!$A:$H,8,0),\"-\")","v":10},{"$f":"IFERROR(VLOOKUP(J30,Entries!$A:$F,6,0),\"-\")","v":"SS Athletics"},"25.49"]
[3,178,{"$f":"IFERROR(VLOOKUP(B31,Entries!$A:$E,5,0),\"-\")","v":"Schofield"},{"$f":"IFERROR(VLOOKUP(B31,Entries!$A:$D,4,0),\"-\")","v":"Milo"},{"$f":"IFERROR(VLOOKUP(B31,Entries!$A:$H,8,0),\"-\")","v":10},{"$f":"IFERROR(VLOOKUP(B31,Entries!$A:$F,6,0),\"-\")","v":"SS Athletics"},"26.33",null,3,108,{"$f":"IFERROR(VLOOKUP(J31,Entries!$A:$E,5,0),\"-\")","v":"Silvain"},{"$f":"IFERROR(VLOOKUP(J31,Entries!$A:$D,4,0),\"-\")","v":"Ella"},{"$f":"IFERROR(VLOOKUP(J31,Entries!$A:$H,8,0),\"-\")","v":10},{"$f":"IFERROR(VLOOKUP(J31,Entries!$A:$F,6,0),\"-\")","v":"Unattached"},"25.75"]
[4,252,{"$f":"IFERROR(VLOOKUP(B32,Entries!$A:$E,5,0),\"-\")","v":"Jones"},{"$f":"IFERROR(VLOOKUP(B32,Entries!$A:$D,4,0),\"-\")","v":"Oliver"},{"$f":"IFERROR(VLOOKUP(B32,Entries!$A:$H,8,0),\"-\")","v":10},{"$f":"IFERROR(VLOOKUP(B32,Entries!$A:$F,6,0),\"-\")","v":"Brentwood Beagles Athletics Club"},"26.48",null,4,325,{"$f":"IFERROR(VLOOKUP(J32,Entries!$A:$E,5,0),\"-\")","v":"Ncube"},{"$f":"IFERROR(VLOOKUP(J32,Entries!$A:$D,4,0),\"-\")","v":"Ruvarashe"},{"$f":"IFERROR(VLOOKUP(J32,Entries!$A:$H,8,0),\"-\")","v":10},{"$f":"IFERROR(VLOOKUP(J32,Entries!$A:$F,6,0),\"-\")","v":"City of Southend-on-Sea Athletic Club"},"25.91"]
[5,193,{"$f":"IFERROR(VLOOKUP(B33,Entries!$A:$E,5,0),\"-\")","v":"Broad"},{"$f":"IFERROR(VLOOKUP(B33,Entries!$A:$D,4,0),\"-\")","v":"Carter"},{"$f":"IFERROR(VLOOKUP(B33,Entries!$A:$H,8,0),\"-\")","v":10},{"$f":"IFERROR(VLOOKUP(B33,Entries!$A:$F,6,0),\"-\")","v":"Benfleet RC"},"26.90",null,5,375,{"$f":"IFERROR(VLOOKUP(J33,Entries!$A:$E,5,0),\"-\")","v":"Heath"},{"$f":"IFERROR(VLOOKUP(J33,Entries!$A:$D,4,0),\"-\")","v":"Naomi"},{"$f":"IFERROR(VLOOKUP(J33,Entries!$A:$H,8,0),\"-\")","v":10},{"$f":"IFERROR(VLOOKUP(J33,Entries!$A:$F,6,0),\"-\")","v":"SS Athletics"},"29.86"]
[6,null,{"$f":"IFERROR(VLOOKUP(B34,Entries!$A:$E,5,0),\"-\")","v":"-"},{"$f":"IFERROR(VLOOKUP(B34,Entries!$A:$D,4,0),\"-\")","v":"-"},{"$f":"IFERROR(VLOOKUP(B34,Entries!$A:$H,8,0),\"-\")","v":"-"},{"$f":"IFERROR(VLOOKUP(B34,Entries!$A:$F,6,0),\"-\")","v":"-"},null,null,6,null,{"$f":"IFERROR(VLOOKUP(J34,Entries!$A:$E,5,0),\"-\")","v":"-"},{"$f":"IFERROR(VLOOKUP(J34,Entries!$A:$D,4,0),\"-\")","v":"-"},{"$f":"IFERROR(VLOOKUP(J34,Entries!$A:$H,8,0),\"-\")","v":"-"},{"$f":"IFERROR(VLOOKUP(J34,Entries!$A:$F,6,0),\"-\")","v":"-"}]
[7,null,{"$f":"IFERROR(VLOOKUP(B35,Entries!$A:$E,5,0),\"-\")","v":"-"},{"$f":"IFERROR(VLOOKUP(B35,Entries!$A:$D,4,0),\"-\")","v":"-"},{"$f":"IFERROR(VLOOKUP(B35,Entries!$A:$H,8,0),\"-\")","v":"-"},{"$f":"IFERROR(VLOOKUP(B35,Entries!$A:$F,6,0),\"-\")","v":"-"},null,null,7,null,{"$f":"IFERROR(VLOOKUP(J35,Entries!$A:$E,5,0),\"-\")","v":"-"},{"$f":"IFERROR(VLOOKUP(J35,Entries!$A:$D,4,0),\"-\")","v":"-"},{"$f":"IFERROR(VLOOKUP(J35,Entries!$A:$H,8,0),\"-\")","v":"-"},{"$f":"IFERROR(VLOOKUP(J35,Entries!$A:$F,6,0),\"-\")","v":"-"}]
[8,null,{"$f":"IFERROR(VLOOKUP(B36,Entries!$A:$E,5,0),\"-\")","v":"-"},{"$f":"IFERROR(VLOOKUP(B36,Entries!$A:$D,4,0),\"-\")","v":"-"},{"$f":"IFERROR(VLOOKUP(B36,Entries!$A:$H,8,0),\"-\")","v":"-"},{"$f":"IFERROR(VLOOKUP(B36,Entries!$A:$F,6,0),\"-\")","v":"-"},null,null,8,null,{"$f":"IFERROR(VLOOKUP(J36,Entries!$A:$E,5,0),\"-\")","v":"-"},{"$f":"IFERROR(VLOOKUP(J36,Entries!$A:$D,4,0),\"-\")","v":"-"},{"$f":"IFERROR(VLOOKUP(J36,Entries!$A:$H,8,0),\"-\")","v":"-"},{"$f":"IFERROR(VLOOKUP(J36,Entries!$A:$F,6,0),\"-\")","v":"-"}]
[]
[]
["U11 Boys Heat 4",null,null,null,null,"Wind",-4.9000000000000004,null,"U11 Girls Heat 4",null,null,null,null,"Wind",-4.3]
["Pos","Number","Last Name","First Name","Age","Club","Time",null,"Pos","Number","Last Name","First Name","Age","Club","Time"]
[1,326,{"$f":"IFERROR(VLOOKUP(B41,Entries!$A:$E,5,0),\"-\")","v":"Kerr"},{"$f":"IFERROR(VLOOKUP(B41,Entries!$A:$D,4,0),\"-\")","v":"Raheim"},{"$f":"IFERROR(VLOOKUP(B41,Entries!$A:$H,8,0),\"-\")","v":10},{"$f":"IFERROR(VLOOKUP(B41,Entries!$A:$F,6,0),\"-\")","v":"SS Athletics"},"22.25",null,1,149,{"$f":"IFERROR(VLOOKUP(J41,Entries!$A:$E,5,0),\"-\")","v":"Lyttle"},{"$f":"IFERROR(VLOOKUP(J41,Entries!$A:$D,4,0),\"-\")","v":"Sofia"},{"$f":"IFERROR(VLOOKUP(J41,Entries!$A:$H,8,0),\"-\")","v":10},{"$f":"IFERROR(VLOOKUP(J41,Entries!$A:$F,6,0),\"-\")","v":"Colchester & Tendring AC"},"23.45"]
[2,226,{"$f":"IFERROR(VLOOKUP(B42,Entries!$A:$E,5,0),\"-\")","v":"Jones"},{"$f":"IFERROR(VLOOKUP(B42,Entries!$A:$D,4,0),\"-\")","v":"Oliver"},{"$f":"IFERROR(VLOOKUP(B42,Entries!$A:$H,8,0),\"-\")","v":10},{"$f":"IFERROR(VLOOKUP(B42,Entries!$A:$F,6,0),\"-\")","v":"Unattached"},"24.54",null,2,49,{"$f":"IFERROR(VLOOKUP(J42,Entries!$A:$E,5,0),\"-\")","v":"Nti-Jackson"},{"$f":"IFERROR(VLOOKUP(J42,Entries!$A:$D,4,0),\"-\")","v":"Danielle"},{"$f":"IFERROR(VLOOKUP(J42,Entries!$A:$H,8,0),\"-\")","v":10},{"$f":"IFERROR(VLOOKUP(J42,Entries!$A:$F,6,0),\"-\")","v":"SS Athletics"},"24.33"]
[3,212,{"$f":"IFERROR(VLOOKUP(B43,Entries!$A:$E,5,0),\"-\")","v":"Sibanda"},{"$f":"IFERROR(VLOOKUP(B43,Entries!$A:$D,4,0),\"-\")","v":"Malachi"},{"$f":"IFERROR(VLOOKUP(B43,Entries!$A:$H,8,0),\"-\")","v":10},{"$f":"IFERROR(VLOOKUP(B43,Entries!$A:$F,6,0),\"-\")","v":"SS Athletics"},"26.31",null,3,9,{"$f":"IFERROR(VLOOKUP(J43,Entries!$A:$E,5,0),\"-\")","v":"Brewington"},{"$f":"IFERROR(VLOOKUP(J43,Entries!$A:$D,4,0),\"-\")","v":"Emily"},{"$f":"IFERROR(VLOOKUP(J43,Entries!$A:$H,8,0),\"-\")","v":10},{"$f":"IFERROR(VLOOKUP(J43,Entries!$A:$F,6,0),\"-\")","v":"Brentwood Beagles Athletics Club"},"25.89"]
[4,316,{"$f":"IFERROR(VLOOKUP(B44,Entries!$A:$E,5,0),\"-\")","v":"McNicholl"},{"$f":"IFERROR(VLOOKUP(B44,Entries!$A:$D,4,0),\"-\")","v":"Jude"},{"$f":"IFERROR(VLOOKUP(B44,Entries!$A:$H,8,0),\"-\")","v":10},{"$f":"IFERROR(VLOOKUP(B44,Entries!$A:$F,6,0),\"-\")","v":"Brentwood Beagles Athletics Club"},"27.19",null,4,15,{"$f":"IFERROR(VLOOKUP(J44,Entries!$A:$E,5,0),\"-\")","v":"Ekerin"},{"$f":"IFERROR(VLOOKUP(J44,Entries!$A:$D,4,0),\"-\")","v":"Temitope"},{"$f":"IFERROR(VLOOKUP(J44,Entries!$A:$H,8,0),\"-\")","v":10},{"$f":"IFERROR(VLOOKUP(J44,Entries!$A:$F,6,0),\"-\")","v":"Unattached"},"26.34"]
[5,null,{"$f":"IFERROR(VLOOKUP(B45,Entries!$A:$E,5,0),\"-\")","v":"-"},{"$f":"IFERROR(VLOOKUP(B45,Entries!$A:$D,4,0),\"-\")","v":"-"},{"$f":"IFERROR(VLOOKUP(B45,Entries!$A:$H,8,0),\"-\")","v":"-"},{"$f":"IFERROR(VLOOKUP(B45,Entries!$A:$F,6,0),\"-\")","v":"-"},null,null,5,null,{"$f":"IFERROR(VLOOKUP(J45,Entries!$A:$E,5,0),\"-\")","v":"-"},{"$f":"IFERROR(VLOOKUP(J45,Entries!$A:$D,4,0),\"-\")","v":"-"},{"$f":"IFERROR(VLOOKUP(J45,Entries!$A:$H,8,0),\"-\")","v":"-"},{"$f":"IFERROR(VLOOKUP(J45,Entries!$A:$F,6,0),\"-\")","v":"-"}]
[6,null,{"$f":"IFERROR(VLOOKUP(B46,Entries!$A:$E,5,0),\"-\")","v":"-"},{"$f":"IFERROR(VLOOKUP(B46,Entries!$A:$D,4,0),\"-\")","v":"-"},{"$f":"IFERROR(VLOOKUP(B46,Entries!$A:$H,8,0),\"-\")","v":"-"},{"$f":"IFERROR(VLOOKUP(B46,Entries!$A:$F,6,0),\"-\")","v":"-"},null,null,6,null,{"$f":"IFERROR(VLOOKUP(J46,Entries!$A:$E,5,0),\"-\")","v":"-"},{"$f":"IFERROR(VLOOKUP(J46,Entries!$A:$D,4,0),\"-\")","v":"-"},{"$f":"IFERROR(VLOOKUP(J46,Entries!$A:$H,8,0),\"-\")","v":"-"},{"$f":"IFERROR(VLOOKUP(J46,Entries!$A:$F,6,0),\"-\")","v":"-"}]
[7,null,{"$f":"IFERROR(VLOOKUP(B47,Entries!$A:$E,5,0),\"-\")","v":"-"},{"$f":"IFERROR(VLOOKUP(B47,Entries!$A:$D,4,0),\"-\")","v":"-"},{"$f":"IFERROR(VLOOKUP(B47,Entries!$A:$H,8,0),\"-\")","v":"-"},{"$f":"IFERROR(VLOOKUP(B47,Entries!$A:$F,6,0),\"-\")","v":"-"},null,null,7,null,{"$f":"IFERROR(VLOOKUP(J47,Entries!$A:$E,5,0),\"-\")","v":"-"},{"$f":"IFERROR(VLOOKUP(J47,Entries!$A:$D,4,0),\"-\")","v":"-"},{"$f":"IFERROR(VLOOKUP(J47,Entries!$A:$H,8,0),\"-\")","v":"-"},{"$f":"IFERROR(VLOOKUP(J47,Entries!$A:$F,6,0),\"-\")","v":"-"}]
[8,null,{"$f":"IFERROR(VLOOKUP(B48,Entries!$A:$E,5,0),\"-\")","v":"-"},{"$f":"IFERROR(VLOOKUP(B48,Entries!$A:$D,4,0),\"-\")","v":"-"},{"$f":"IFERROR(VLOOKUP(B48,Entries!$A:$H,8,0),\"-\")","v":"-"},{"$f":"IFERROR(VLOOKUP(B48,Entries!$A:$F,6,0),\"-\")","v":"-"},null,null,8,null,{"$f":"IFERROR(VLOOKUP(J48,Entries!$A:$E,5,0),\"-\")","v":"-"},{"$f":"IFERROR(VLOOKUP(J48,Entries!$A:$D,4,0),\"-\")","v":"-"},{"$f":"IFERROR(VLOOKUP(J48,Entries!$A:$H,8,0),\"-\")","v":"-"},{"$f":"IFERROR(VLOOKUP(J48,Entries!$A:$F,6,0),\"-\")","v":"-"}]

{"sheet":"200m","index":8,"n_rows":103,"n_cols":15,"rows_kept":103,"cut":false,"hidden":false,"merged":[]}
["200m"]
[]
["U13 Boys Heat 1",null,null,null,null,"Wind",-4.5,null,"U13 Girls Heat 1",null,null,null,null,"Wind",-4.0999999999999996]
["Pos","Number","Last Name","First Name","Age","Club","Time",null,"Pos","Number","Last Name","First Name","Age","Club","Time"]
[1,65,{"$f":"IFERROR(VLOOKUP(B5,Entries!$A:$E,5,0),\"-\")","v":"Hay"},{"$f":"IFERROR(VLOOKUP(B5,Entries!$A:$D,4,0),\"-\")","v":"Logan"},{"$f":"IFERROR(VLOOKUP(B5,Entries!$A:$H,8,0),\"-\")","v":12},{"$f":"IFERROR(VLOOKUP(B5,Entries!$A:$F,6,0),\"-\")","v":"SS Athletics"},"27.56",null,1,276,{"$f":"IFERROR(VLOOKUP(J5,Entries!$A:$E,5,0),\"-\")","v":"Martell-Smith"},{"$f":"IFERROR(VLOOKUP(J5,Entries!$A:$D,4,0),\"-\")","v":"Lacey"},{"$f":"IFERROR(VLOOKUP(J5,Entries!$A:$H,8,0),\"-\")","v":11},{"$f":"IFERROR(VLOOKUP(J5,Entries!$A:$F,6,0),\"-\")","v":"Colchester Harriers AC"},"29.95"]
[2,40,{"$f":"IFERROR(VLOOKUP(B6,Entries!$A:$E,5,0),\"-\")","v":"Cheetham"},{"$f":"IFERROR(VLOOKUP(B6,Entries!$A:$D,4,0),\"-\")","v":"Max"},{"$f":"IFERROR(VLOOKUP(B6,Entries!$A:$H,8,0),\"-\")","v":11},{"$f":"IFERROR(VLOOKUP(B6,Entries!$A:$F,6,0),\"-\")","v":"Brentwood Beagles Athletics Club"},"29.08",null,2,283,{"$f":"IFERROR(VLOOKUP(J6,Entries!$A:$E,5,0),\"-\")","v":"Freese"},{"$f":"IFERROR(VLOOKUP(J6,Entries!$A:$D,4,0),\"-\")","v":"Zara"},{"$f":"IFERROR(VLOOKUP(J6,Entries!$A:$H,8,0),\"-\")","v":11},{"$f":"IFERROR(VLOOKUP(J6,Entries!$A:$F,6,0),\"-\")","v":"SS Athletics"},"30.13"]
[3,329,{"$f":"IFERROR(VLOOKUP(B7,Entries!$A:$E,5,0),\"-\")","v":"Keenan"},{"$f":"IFERROR(VLOOKUP(B7,Entries!$A:$D,4,0),\"-\")","v":"Xavier"},{"$f":"IFERROR(VLOOKUP(B7,Entries!$A:$H,8,0),\"-\")","v":12},{"$f":"IFERROR(VLOOKUP(B7,Entries!$A:$F,6,0),\"-\")","v":"SS Athletics"},"29.88",null,3,151,{"$f":"IFERROR(VLOOKUP(J7,Entries!$A:$E,5,0),\"-\")","v":"Radley"},{"$f":"IFERROR(VLOOKUP(J7,Entries!$A:$D,4,0),\"-\")","v":"Lucia"},{"$f":"IFERROR(VLOOKUP(J7,Entries!$A:$H,8,0),\"-\")","v":11},{"$f":"IFERROR(VLOOKUP(J7,Entries!$A:$F,6,0),\"-\")","v":"SS Athletics"},"30.65"]
[4,163,{"$f":"IFERROR(VLOOKUP(B8,Entries!$A:$E,5,0),\"-\")","v":"Birnie"},{"$f":"IFERROR(VLOOKUP(B8,Entries!$A:$D,4,0),\"-\")","v":"Ryan"},{"$f":"IFERROR(VLOOKUP(B8,Entries!$A:$H,8,0),\"-\")","v":11},{"$f":"IFERROR(VLOOKUP(B8,Entries!$A:$F,6,0),\"-\")","v":"SS Athletics"},"32.81",null,4,235,{"$f":"IFERROR(VLOOKUP(J8,Entries!$A:$E,5,0),\"-\")","v":"Finlay"},{"$f":"IFERROR(VLOOKUP(J8,Entries!$A:$D,4,0),\"-\")","v":"Scarlett"},{"$f":"IFERROR(VLOOKUP(J8,Entries!$A:$H,8,0),\"-\")","v":11},{"$f":"IFERROR(VLOOKUP(J8,Entries!$A:$F,6,0),\"-\")","v":"Watford Harriers"},"30.95"]
[5,269,{"$f":"IFERROR(VLOOKUP(B9,Entries!$A:$E,5,0),\"-\")","v":"Frisby-Bright"},{"$f":"IFERROR(VLOOKUP(B9,Entries!$A:$D,4,0),\"-\")","v":"Ethan"},{"$f":"IFERROR(VLOOKUP(B9,Entries!$A:$H,8,0),\"-\")","v":11},{"$f":"IFERROR(VLOOKUP(B9,Entries!$A:$F,6,0),\"-\")","v":"Haverhill Running Club"},"35.37",null,5,1,{"$f":"IFERROR(VLOOKUP(J9,Entries!$A:$E,5,0),\"-\")","v":"Awoyode"},{"$f":"IFERROR(VLOOKUP(J9,Entries!$A:$D,4,0),\"-\")","v":"Maria Oreoluwa"},{"$f":"IFERROR(VLOOKUP(J9,Entries!$A:$H,8,0),\"-\")","v":11},{"$f":"IFERROR(VLOOKUP(J9,Entries!$A:$F,6,0),\"-\")","v":"Aldershot Farnham & District"},"33.29"]
[6,132,{"$f":"IFERROR(VLOOKUP(B10,Entries!$A:$E,5,0),\"-\")","v":"Fox"},{"$f":"IFERROR(VLOOKUP(B10,Entries!$A:$D,4,0),\"-\")","v":"Ketan"},{"$f":"IFERROR(VLOOKUP(B10,Entries!$A:$H,8,0),\"-\")","v":11},{"$f":"IFERROR(VLOOKUP(B10,Entries!$A:$F,6,0),\"-\")","v":"Unattached"},"36.95",null,6,301,{"$f":"IFERROR(VLOOKUP(J10,Entries!$A:$E,5,0),\"-\")","v":"Robson"},{"$f":"IFERROR(VLOOKUP(J10,Entries!$A:$D,4,0),\"-\")","v":"Alexandra"},{"$f":"IFERROR(VLOOKUP(J10,Entries!$A:$H,8,0),\"-\")","v":11},{"$f":"IFERROR(VLOOKUP(J10,Entries!$A:$F,6,0),\"-\")","v":"SS Athletics"},"36.42"]
[7,null,{"$f":"IFERROR(VLOOKUP(B11,Entries!$A:$E,5,0),\"-\")","v":"-"},{"$f":"IFERROR(VLOOKUP(B11,Entries!$A:$D,4,0),\"-\")","v":"-"},{"$f":"IFERROR(VLOOKUP(B11,Entries!$A:$H,8,0),\"-\")","v":"-"},{"$f":"IFERROR(VLOOKUP(B11,Entries!$A:$F,6,0),\"-\")","v":"-"},null,null,7,38,{"$f":"IFERROR(VLOOKUP(J11,Entries!$A:$E,5,0),\"-\")","v":"Gault-Poyntz"},{"$f":"IFERROR(VLOOKUP(J11,Entries!$A:$D,4,0),\"-\")","v":"Allegra"},{"$f":"IFERROR(VLOOKUP(J11,Entries!$A:$H,8,0),\"-\")","v":11},{"$f":"IFERROR(VLOOKUP(J11,Entries!$A:$F,6,0),\"-\")","v":"City of Southend On Sea AC"},"36.43"]
[8,null,{"$f":"IFERROR(VLOOKUP(B12,Entries!$A:$E,5,0),\"-\")","v":"-"},{"$f":"IFERROR(VLOOKUP(B12,Entries!$A:$D,4,0),\"-\")","v":"-"},{"$f":"IFERROR(VLOOKUP(B12,Entries!$A:$H,8,0),\"-\")","v":"-"},{"$f":"IFERROR(VLOOKUP(B12,Entries!$A:$F,6,0),\"-\")","v":"-"},null,null,8,null,{"$f":"IFERROR(VLOOKUP(J12,Entries!$A:$E,5,0),\"-\")","v":"-"},{"$f":"IFERROR(VLOOKUP(J12,Entries!$A:$D,4,0),\"-\")","v":"-"},{"$f":"IFERROR(VLOOKUP(J12,Entries!$A:$H,8,0),\"-\")","v":"-"},{"$f":"IFERROR(VLOOKUP(J12,Entries!$A:$F,6,0),\"-\")","v":"-"}]
[]
[]
["U15 Boys Heat 1",null,null,null,null,"Wind",-3.3,null,"U13 Girls Heat 2",null,null,null,null,"Wind",-4.5]
["Pos","Number","Last Name","First Name","Age","Club","Time",null,"Pos","Number","Last Name","First Name","Age","Club","Time"]
[1,145,{"$f":"IFERROR(VLOOKUP(B17,Entries!$A:$E,5,0),\"-\")","v":"Bates"},{"$f":"IFERROR(VLOOKUP(B17,Entries!$A:$D,4,0),\"-\")","v":"Finn"},{"$f":"IFERROR(VLOOKUP(B17,Entries!$A:$H,8,0),\"-\")","v":14},{"$f":"IFERROR(VLOOKUP(B17,Entries!$A:$F,6,0),\"-\")","v":"Colchester & Tendring AC"},"24.42",null,1,229,{"$f":"IFERROR(VLOOKUP(J17,Entries!$A:$E,5,0),\"-\")","v":"Taylor"},{"$f":"IFERROR(VLOOKUP(J17,Entries!$A:$D,4,0),\"-\")","v":"Scarlett"},{"$f":"IFERROR(VLOOKUP(J17,Entries!$A:$H,8,0),\"-\")","v":12},{"$f":"IFERROR(VLOOKUP(J17,Entries!$A:$F,6,0),\"-\")","v":"Aldershot Farnham & District"},"27.88"]
[2,374,{"$f":"IFERROR(VLOOKUP(B18,Entries!$A:$E,5,0),\"-\")","v":"Mendoza"},{"$f":"IFERROR(VLOOKUP(B18,Entries!$A:$D,4,0),\"-\")","v":"Daniel"},{"$f":"IFERROR(VLOOKUP(B18,Entries!$A:$H,8,0),\"-\")","v":14},{"$f":"IFERROR(VLOOKUP(B18,Entries!$A:$F,6,0),\"-\")","v":"City of Southend On Sea AC"},"26.13",null,2,78,{"$f":"IFERROR(VLOOKUP(J18,Entries!$A:$E,5,0),\"-\")","v":"Simpson"},{"$f":"IFERROR(VLOOKUP(J18,Entries!$A:$D,4,0),\"-\")","v":"Kylin"},{"$f":"IFERROR(VLOOKUP(J18,Entries!$A:$H,8,0),\"-\")","v":12},{"$f":"IFERROR(VLOOKUP(J18,Entries!$A:$F,6,0),\"-\")","v":"Aldershot Farnham & District"},"28.36"]
[3,63,{"$f":"IFERROR(VLOOKUP(B19,Entries!$A:$E,5,0),\"-\")","v":"Hill"},{"$f":"IFERROR(VLOOKUP(B19,Entries!$A:$D,4,0),\"-\")","v":"George"},{"$f":"IFERROR(VLOOKUP(B19,Entries!$A:$H,8,0),\"-\")","v":13},{"$f":"IFERROR(VLOOKUP(B19,Entries!$A:$F,6,0),\"-\")","v":"City of Southend On Sea AC"},"26.89",null,3,138,{"$f":"IFERROR(VLOOKUP(J19,Entries!$A:$E,5,0),\"-\")","v":"Marshment"},{"$f":"IFERROR(VLOOKUP(J19,Entries!$A:$D,4,0),\"-\")","v":"Bella"},{"$f":"IFERROR(VLOOKUP(J19,Entries!$A:$H,8,0),\"-\")","v":12},{"$f":"IFERROR(VLOOKUP(J19,Entries!$A:$F,6,0),\"-\")","v":"Herts Phoenix AC"},"30.56"]
[4,263,{"$f":"IFERROR(VLOOKUP(B20,Entries!$A:$E,5,0),\"-\")","v":"Thompson"},{"$f":"IFERROR(VLOOKUP(B20,Entries!$A:$D,4,0),\"-\")","v":"George"},{"$f":"IFERROR(VLOOKUP(B20,Entries!$A:$H,8,0),\"-\")","v":13},{"$f":"IFERROR(VLOOKUP(B20,Entries!$A:$F,6,0),\"-\")","v":"City of Southend On Sea AC"},"26.91",null,4,100,{"$f":"IFERROR(VLOOKUP(J20,Entries!$A:$E,5,0),\"-\")","v":"Scragg"},{"$f":"IFERROR(VLOOKUP(J20,Entries!$A:$D,4,0),\"-\")","v":"Abigail"},{"$f":"IFERROR(VLOOKUP(J20,Entries!$A:$H,8,0),\"-\")","v":12},{"$f":"IFERROR(VLOOKUP(J20,Entries!$A:$F,6,0),\"-\")","v":"Camberley & District AC"},"35.19"]
[5,56,{"$f":"IFERROR(VLOOKUP(B21,Entries!$A:$E,5,0),\"-\")","v":"Byford"},{"$f":"IFERROR(VLOOKUP(B21,Entries!$A:$D,4,0),\"-\")","v":"Poppy"},{"$f":"IFERROR(VLOOKUP(B21,Entries!$A:$H,8,0),\"-\")","v":11},{"$f":"IFERROR(VLOOKUP(B21,Entries!$A:$F,6,0),\"-\")","v":"City of Southend On Sea AC"},"28.73",null,5,null,{"$f":"IFERROR(VLOOKUP(J21,Entries!$A:$E,5,0),\"-\")","v":"-"},{"$f":"IFERROR(VLOOKUP(J21,Entries!$A:$D,4,0),\"-\")","v":"-"},{"$f":"IFERROR(VLOOKUP(J21,Entries!$A:$H,8,0),\"-\")","v":"-"},{"$f":"IFERROR(VLOOKUP(J21,Entries!$A:$F,6,0),\"-\")","v":"-"}]
[6,null,{"$f":"IFERROR(VLOOKUP(B22,Entries!$A:$E,5,0),\"-\")","v":"-"},{"$f":"IFERROR(VLOOKUP(B22,Entries!$A:$D,4,0),\"-\")","v":"-"},{"$f":"IFERROR(VLOOKUP(B22,Entries!$A:$H,8,0),\"-\")","v":"-"},{"$f":"IFERROR(VLOOKUP(B22,Entries!$A:$F,6,0),\"-\")","v":"-"},null,null,6,null,{"$f":"IFERROR(VLOOKUP(J22,Entries!$A:$E,5,0),\"-\")","v":"-"},{"$f":"IFERROR(VLOOKUP(J22,Entries!$A:$D,4,0),\"-\")","v":"-"},{"$f":"IFERROR(VLOOKUP(J22,Entries!$A:$H,8,0),\"-\")","v":"-"},{"$f":"IFERROR(VLOOKUP(J22,Entries!$A:$F,6,0),\"-\")","v":"-"}]
[7,null,{"$f":"IFERROR(VLOOKUP(B23,Entries!$A:$E,5,0),\"-\")","v":"-"},{"$f":"IFERROR(VLOOKUP(B23,Entries!$A:$D,4,0),\"-\")","v":"-"},{"$f":"IFERROR(VLOOKUP(B23,Entries!$A:$H,8,0),\"-\")","v":"-"},{"$f":"IFERROR(VLOOKUP(B23,Entries!$A:$F,6,0),\"-\")","v":"-"},null,null,7,null,{"$f":"IFERROR(VLOOKUP(J23,Entries!$A:$E,5,0),\"-\")","v":"-"},{"$f":"IFERROR(VLOOKUP(J23,Entries!$A:$D,4,0),\"-\")","v":"-"},{"$f":"IFERROR(VLOOKUP(J23,Entries!$A:$H,8,0),\"-\")","v":"-"},{"$f":"IFERROR(VLOOKUP(J23,Entries!$A:$F,6,0),\"-\")","v":"-"}]
[8,null,{"$f":"IFERROR(VLOOKUP(B24,Entries!$A:$E,5,0),\"-\")","v":"-"},{"$f":"IFERROR(VLOOKUP(B24,Entries!$A:$D,4,0),\"-\")","v":"-"},{"$f":"IFERROR(VLOOKUP(B24,Entries!$A:$H,8,0),\"-\")","v":"-"},{"$f":"IFERROR(VLOOKUP(B24,Entries!$A:$F,6,0),\"-\")","v":"-"},null,null,8,null,{"$f":"IFERROR(VLOOKUP(J24,Entries!$A:$E,5,0),\"-\")","v":"-"},{"$f":"IFERROR(VLOOKUP(J24,Entries!$A:$D,4,0),\"-\")","v":"-"},{"$f":"IFERROR(VLOOKUP(J24,Entries!$A:$H,8,0),\"-\")","v":"-"},{"$f":"IFERROR(VLOOKUP(J24,Entries!$A:$F,6,0),\"-\")","v":"-"}]
[]
[null,null,null,null,null,null,null,null,"U13 Girls Heat 3",null,null,null,null,"Wind",-3.7]
[null,null,null,null,null,null,null,null,"Pos","Number","Last Name","First Name","Age","Club","Time"]
[null,null,null,null,null,null,null,null,1,303,{"$f":"IFERROR(VLOOKUP(J28,Entries!$A:$E,5,0),\"-\")","v":"Bucci"},{"$f":"IFERROR(VLOOKUP(J28,Entries!$A:$D,4,0),\"-\")","v":"Kai"},{"$f":"IFERROR(VLOOKUP(J28,Entries!$A:$H,8,0),\"-\")","v":12},{"$f":"IFERROR(VLOOKUP(J28,Entries!$A:$F,6,0),\"-\")","v":"SS Athletics"},"30.41"]
[null,null,null,null,null,null,null,null,2,181,{"$f":"IFERROR(VLOOKUP(J29,Entries!$A:$E,5,0),\"-\")","v":"Williams"},{"$f":"IFERROR(VLOOKUP(J29,Entries!$A:$D,4,0),\"-\")","v":"Zenobia"},{"$f":"IFERROR(VLOOKUP(J29,Entries!$A:$H,8,0),\"-\")","v":12},{"$f":"IFERROR(VLOOKUP(J29,Entries!$A:$F,6,0),\"-\")","v":"Havering AC"},"30.90"]
[null,null,null,null,null,null,null,null,3,309,{"$f":"IFERROR(VLOOKUP(J30,Entries!$A:$E,5,0),\"-\")","v":"Sandell"},{"$f":"IFERROR(VLOOKUP(J30,Entries!$A:$D,4,0),\"-\")","v":"Anais"},{"$f":"IFERROR(VLOOKUP(J30,Entries!$A:$H,8,0),\"-\")","v":12},{"$f":"IFERROR(VLOOKUP(J30,Entries!$A:$F,6,0),\"-\")","v":"SS Athletics"},"33.87"]
[null,null,null,null,null,null,null,null,4,324,{"$f":"IFERROR(VLOOKUP(J31,Entries!$A:$E,5,0),\"-\")","v":"Ncube"},{"$f":"IFERROR(VLOOKUP(J31,Entries!$A:$D,4,0),\"-\")","v":"Kundai"},{"$f":"IFERROR(VLOOKUP(J31,Entries!$A:$H,8,0),\"-\")","v":12},{"$f":"IFERROR(VLOOKUP(J31,Entries!$A:$F,6,0),\"-\")","v":"City of Southend On Sea AC"},"35.72"]
[null,null,null,null,null,null,null,null,5,null,{"$f":"IFERROR(VLOOKUP(J32,Entries!$A:$E,5,0),\"-\")","v":"-"},{"$f":"IFERROR(VLOOKUP(J32,Entries!$A:$D,4,0),\"-\")","v":"-"},{"$f":"IFERROR(VLOOKUP(J32,Entries!$A:$H,8,0),\"-\")","v":"-"},{"$f":"IFERROR(VLOOKUP(J32,Entries!$A:$F,6,0),\"-\")","v":"-"}]
[null,null,null,null,null,null,null,null,6,null,{"$f":"IFERROR(VLOOKUP(J33,Entries!$A:$E,5,0),\"-\")","v":"-"},{"$f":"IFERROR(VLOOKUP(J33,Entries!$A:$D,4,0),\"-\")","v":"-"},{"$f":"IFERROR(VLOOKUP(J33,Entries!$A:$H,8,0),\"-\")","v":"-"},{"$f":"IFERROR(VLOOKUP(J33,Entries!$A:$F,6,0),\"-\")","v":"-"}]
[null,null,null,null,null,null,null,null,7,null,{"$f":"IFERROR(VLOOKUP(J34,Entries!$A:$E,5,0),\"-\")","v":"-"},{"$f":"IFERROR(VLOOKUP(J34,Entries!$A:$D,4,0),\"-\")","v":"-"},{"$f":"IFERROR(VLOOKUP(J34,Entries!$A:$H,8,0),\"-\")","v":"-"},{"$f":"IFERROR(VLOOKUP(J34,Entries!$A:$F,6,0),\"-\")","v":"-"}]
[null,null,null,null,null,null,null,null,8,null,{"$f":"IFERROR(VLOOKUP(J35,Entries!$A:$E,5,0),\"-\")","v":"-"},{"$f":"IFERROR(VLOOKUP(J35,Entries!$A:$D,4,0),\"-\")","v":"-"},{"$f":"IFERROR(VLOOKUP(J35,Entries!$A:$H,8,0),\"-\")","v":"-"},{"$f":"IFERROR(VLOOKUP(J35,Entries!$A:$F,6,0),\"-\")","v":"-"}]
[]
[]
[]
[null,null,null,null,null,null,null,null,"U15 Girls Heat 1",null,null,null,null,"Wind",-2.2999999999999998]
[null,null,null,null,null,null,null,null,"Pos","Number","Last Name","First Name","Age","Club","Time"]
["U17 Men",null,null,null,null,"Wind",-4,null,1,230,{"$f":"IFERROR(VLOOKUP(J41,Entries!$A:$E,5,0),\"-\")","v":"Hartman"},{"$f":"IFERROR(VLOOKUP(J41,Entries!$A:$D,4,0),\"-\")","v":"Lily"},{"$f":"IFERROR(VLOOKUP(J41,Entries!$A:$H,8,0),\"-\")","v":14},{"$f":"IFERROR(VLOOKUP(J41,Entries!$A:$F,6,0),\"-\")","v":"Basildon AC"},"26.53"]
["Pos","Number","Last Name","First Name","Age","Club","Time",null,2,27,{"$f":"IFERROR(VLOOKUP(J42,Entries!$A:$E,5,0),\"-\")","v":"Boygle"},{"$f":"IFERROR(VLOOKUP(J42,Entries!$A:$D,4,0),\"-\")","v":"Evie"},{"$f":"IFERROR(VLOOKUP(J42,Entries!$A:$H,8,0),\"-\")","v":13},{"$f":"IFERROR(VLOOKUP(J42,Entries!$A:$F,6,0),\"-\")","v":"City of Southend On Sea AC"},"27.69"]
[1,331,{"$f":"IFERROR(VLOOKUP(B43,Entries!$A:$E,5,0),\"-\")","v":"Adeosun"},{"$f":"IFERROR(VLOOKUP(B43,Entries!$A:$D,4,0),\"-\")","v":"Maxwell"},{"$f":"IFERROR(VLOOKUP(B43,Entries!$A:$H,8,0),\"-\")","v":15},{"$f":"IFERROR(VLOOKUP(B43,Entries!$A:$F,6,0),\"-\")","v":"Havering AC"},"23.98",null,3,215,{"$f":"IFERROR(VLOOKUP(J43,Entries!$A:$E,5,0),\"-\")","v":"Hawkins"},{"$f":"IFERROR(VLOOKUP(J43,Entries!$A:$D,4,0),\"-\")","v":"Nicole"},{"$f":"IFERROR(VLOOKUP(J43,Entries!$A:$H,8,0),\"-\")","v":14},{"$f":"IFERROR(VLOOKUP(J43,Entries!$A:$F,6,0),\"-\")","v":"Brentwood Beagles Athletics Club"},"27.97"]
[2,353,{"$f":"IFERROR(VLOOKUP(B44,Entries!$A:$E,5,0),\"-\")","v":"Whiteley"},{"$f":"IFERROR(VLOOKUP(B44,Entries!$A:$D,4,0),\"-\")","v":"Jerome"},{"$f":"IFERROR(VLOOKUP(B44,Entries!$A:$H,8,0),\"-\")","v":15},{"$f":"IFERROR(VLOOKUP(B44,Entries!$A:$F,6,0),\"-\")","v":"City of Southend On Sea AC"},"24.06",null,4,64,{"$f":"IFERROR(VLOOKUP(J44,Entries!$A:$E,5,0),\"-\")","v":"McCart"},{"$f":"IFERROR(VLOOKUP(J44,Entries!$A:$D,4,0),\"-\")","v":"Harriet"},{"$f":"IFERROR(VLOOKUP(J44,Entries!$A:$H,8,0),\"-\")","v":14},{"$f":"IFERROR(VLOOKUP(J44,Entries!$A:$F,6,0),\"-\")","v":"Ipswich Jaffa RC"},"30.57"]
[3,null,{"$f":"IFERROR(VLOOKUP(B45,Entries!$A:$E,5,0),\"-\")","v":"-"},{"$f":"IFERROR(VLOOKUP(B45,Entries!$A:$D,4,0),\"-\")","v":"-"},{"$f":"IFERROR(VLOOKUP(B45,Entries!$A:$H,8,0),\"-\")","v":"-"},{"$f":"IFERROR(VLOOKUP(B45,Entries!$A:$F,6,0),\"-\")","v":"-"},null,null,5,null,{"$f":"IFERROR(VLOOKUP(J45,Entries!$A:$E,5,0),\"-\")","v":"-"},{"$f":"IFERROR(VLOOKUP(J45,Entries!$A:$D,4,0),\"-\")","v":"-"},{"$f":"IFERROR(VLOOKUP(J45,Entries!$A:$H,8,0),\"-\")","v":"-"},{"$f":"IFERROR(VLOOKUP(J45,Entries!$A:$F,6,0),\"-\")","v":"-"}]
[4,null,{"$f":"IFERROR(VLOOKUP(B46,Entries!$A:$E,5,0),\"-\")","v":"-"},{"$f":"IFERROR(VLOOKUP(B46,Entries!$A:$D,4,0),\"-\")","v":"-"},{"$f":"IFERROR(VLOOKUP(B46,Entries!$A:$H,8,0),\"-\")","v":"-"},{"$f":"IFERROR(VLOOKUP(B46,Entries!$A:$F,6,0),\"-\")","v":"-"},null,null,6,null,{"$f":"IFERROR(VLOOKUP(J46,Entries!$A:$E,5,0),\"-\")","v":"-"},{"$f":"IFERROR(VLOOKUP(J46,Entries!$A:$D,4,0),\"-\")","v":"-"},{"$f":"IFERROR(VLOOKUP(J46,Entries!$A:$H,8,0),\"-\")","v":"-"},{"$f":"IFERROR(VLOOKUP(J46,Entries!$A:$F,6,0),\"-\")","v":"-"}]
[5,null,{"$f":"IFERROR(VLOOKUP(B47,Entries!$A:$E,5,0),\"-\")","v":"-"},{"$f":"IFERROR(VLOOKUP(B47,Entries!$A:$D,4,0),\"-\")","v":"-"},{"$f":"IFERROR(VLOOKUP(B47,Entries!$A:$H,8,0),\"-\")","v":"-"},{"$f":"IFERROR(VLOOKUP(B47,Entries!$A:$F,6,0),\"-\")","v":"-"},null,null,7,null,{"$f":"IFERROR(VLOOKUP(J47,Entries!$A:$E,5,0),\"-\")","v":"-"},{"$f":"IFERROR(VLOOKUP(J47,Entries!$A:$D,4,0),\"-\")","v":"-"},{"$f":"IFERROR(VLOOKUP(J47,Entries!$A:$H,8,0),\"-\")","v":"-"},{"$f":"IFERROR(VLOOKUP(J47,Entries!$A:$F,6,0),\"-\")","v":"-"}]
[6,null,{"$f":"IFERROR(VLOOKUP(B48,Entries!$A:$E,5,0),\"-\")","v":"-"},{"$f":"IFERROR(VLOOKUP(B48,Entries!$A:$D,4,0),\"-\")","v":"-"},{"$f":"IFERROR(VLOOKUP(B48,Entries!$A:$H,8,0),\"-\")","v":"-"},{"$f":"IFERROR(VLOOKUP(B48,Entries!$A:$F,6,0),\"-\")","v":"-"},null,null,8,null,{"$f":"IFERROR(VLOOKUP(J48,Entries!$A:$E,5,0),\"-\")","v":"-"},{"$f":"IFERROR(VLOOKUP(J48,Entries!$A:$D,4,0),\"-\")","v":"-"},{"$f":"IFERROR(VLOOKUP(J48,Entries!$A:$H,8,0),\"-\")","v":"-"},{"$f":"IFERROR(VLOOKUP(J48,Entries!$A:$F,6,0),\"-\")","v":"-"}]
[7,null,{"$f":"IFERROR(VLOOKUP(B49,Entries!$A:$E,5,0),\"-\")","v":"-"},{"$f":"IFERROR(VLOOKUP(B49,Entries!$A:$D,4,0),\"-\")","v":"-"},{"$f":"IFERROR(VLOOKUP(B49,Entries!$A:$H,8,0),\"-\")","v":"-"},{"$f":"IFERROR(VLOOKUP(B49,Entries!$A:$F,6,0),\"-\")","v":"-"},null,null,9,null,{"$f":"IFERROR(VLOOKUP(J49,Entries!$A:$E,5,0),\"-\")","v":"-"},{"$f":"IFERROR(VLOOKUP(J49,Entries!$A:$D,4,0),\"-\")","v":"-"},{"$f":"IFERROR(VLOOKUP(J49,Entries!$A:$H,8,0),\"-\")","v":"-"},{"$f":"IFERROR(VLOOKUP(J49,Entries!$A:$F,6,0),\"-\")","v":"-"}]
[8,null,{"$f":"IFERROR(VLOOKUP(B50,Entries!$A:$E,5,0),\"-\")","v":"-"},{"$f":"IFERROR(VLOOKUP(B50,Entries!$A:$D,4,0),\"-\")","v":"-"},{"$f":"IFERROR(VLOOKUP(B50,Entries!$A:$H,8,0),\"-\")","v":"-"},{"$f":"IFERROR(VLOOKUP(B50,Entries!$A:$F,6,0),\"-\")","v":"-"},null,null,10,null,{"$f":"IFERROR(VLOOKUP(J50,Entries!$A:$E,5,0),\"-\")","v":"-"},{"$f":"IFERROR(VLOOKUP(J50,Entries!$A:$D,4,0),\"-\")","v":"-"},{"$f":"IFERROR(VLOOKUP(J50,Entries!$A:$H,8,0),\"-\")","v":"-"},{"$f":"IFERROR(VLOOKUP(J50,Entries!$A:$F,6,0),\"-\")","v":"-"}]
[]
[]
["Senior Men",null,null,null,null,"Wind",-4,null,"U15 Girls Heat 2",null,null,null,null,"Wind",-3.4]
["Pos","Number","Last Name","First Name","Age","Club","Time",null,"Pos","Number","Last Name","First Name","Age","Club","Time"]
[1,342,{"$f":"IFERROR(VLOOKUP(B55,Entries!$A:$E,5,0),\"-\")","v":"Berrett"},{"$f":"IFERROR(VLOOKUP(B55,Entries!$A:$D,4,0),\"-\")","v":"Louis"},{"$f":"IFERROR(VLOOKUP(B55,Entries!$A:$H,8,0),\"-\")","v":22},{"$f":"IFERROR(VLOOKUP(B55,Entries!$A:$F,6,0),\"-\")","v":"Havering AC"},"24.36",null,1,207,{"$f":"IFERROR(VLOOKUP(J55,Entries!$A:$E,5,0),\"-\")","v":"McGowan"},{"$f":"IFERROR(VLOOKUP(J55,Entries!$A:$D,4,0),\"-\")","v":"Freya "},{"$f":"IFERROR(VLOOKUP(J55,Entries!$A:$H,8,0),\"-\")","v":13},{"$f":"IFERROR(VLOOKUP(J55,Entries!$A:$F,6,0),\"-\")","v":"Watford Harriers"},"28.64"]
[2,null,{"$f":"IFERROR(VLOOKUP(B56,Entries!$A:$E,5,0),\"-\")","v":"-"},{"$f":"IFERROR(VLOOKUP(B56,Entries!$A:$D,4,0),\"-\")","v":"-"},{"$f":"IFERROR(VLOOKUP(B56,Entries!$A:$H,8,0),\"-\")","v":"-"},{"$f":"IFERROR(VLOOKUP(B56,Entries!$A:$F,6,0),\"-\")","v":"-"},null,null,2,94,{"$f":"IFERROR(VLOOKUP(J56,Entries!$A:$E,5,0),\"-\")","v":"Poulter"},{"$f":"IFERROR(VLOOKUP(J56,Entries!$A:$D,4,0),\"-\")","v":"Madison"},{"$f":"IFERROR(VLOOKUP(J56,Entries!$A:$H,8,0),\"-\")","v":14},{"$f":"IFERROR(VLOOKUP(J56,Entries!$A:$F,6,0),\"-\")","v":"Chelmsford AC"},"30.53"]
[3,null,{"$f":"IFERROR(VLOOKUP(B57,Entries!$A:$E,5,0),\"-\")","v":"-"},{"$f":"IFERROR(VLOOKUP(B57,Entries!$A:$D,4,0),\"-\")","v":"-"},{"$f":"IFERROR(VLOOKUP(B57,Entries!$A:$H,8,0),\"-\")","v":"-"},{"$f":"IFERROR(VLOOKUP(B57,Entries!$A:$F,6,0),\"-\")","v":"-"},null,null,3,18,{"$f":"IFERROR(VLOOKUP(J57,Entries!$A:$E,5,0),\"-\")","v":"Makepeace"},{"$f":"IFERROR(VLOOKUP(J57,Entries!$A:$D,4,0),\"-\")","v":"Stevie"},{"$f":"IFERROR(VLOOKUP(J57,Entries!$A:$H,8,0),\"-\")","v":13},{"$f":"IFERROR(VLOOKUP(J57,Entries!$A:$F,6,0),\"-\")","v":"City of Southend On Sea AC"},"30.58"]
[4,null,{"$f":"IFERROR(VLOOKUP(B58,Entries!$A:$E,5,0),\"-\")","v":"-"},{"$f":"IFERROR(VLOOKUP(B58,Entries!$A:$D,4,0),\"-\")","v":"-"},{"$f":"IFERROR(VLOOKUP(B58,Entries!$A:$H,8,0),\"-\")","v":"-"},{"$f":"IFERROR(VLOOKUP(B58,Entries!$A:$F,6,0),\"-\")","v":"-"},null,null,4,191,{"$f":"IFERROR(VLOOKUP(J58,Entries!$A:$E,5,0),\"-\")","v":"Moss"},{"$f":"IFERROR(VLOOKUP(J58,Entries!$A:$D,4,0),\"-\")","v":"Cherri"},{"$f":"IFERROR(VLOOKUP(J58,Entries!$A:$H,8,0),\"-\")","v":13},{"$f":"IFERROR(VLOOKUP(J58,Entries!$A:$F,6,0),\"-\")","v":"Chelmsford AC"},"31.14"]
[5,null,{"$f":"IFERROR(VLOOKUP(B59,Entries!$A:$E,5,0),\"-\")","v":"-"},{"$f":"IFERROR(VLOOKUP(B59,Entries!$A:$D,4,0),\"-\")","v":"-"},{"$f":"IFERROR(VLOOKUP(B59,Entries!$A:$H,8,0),\"-\")","v":"-"},{"$f":"IFERROR(VLOOKUP(B59,Entries!$A:$F,6,0),\"-\")","v":"-"},null,null,5,null,{"$f":"IFERROR(VLOOKUP(J59,Entries!$A:$E,5,0),\"-\")","v":"-"},{"$f":"IFERROR(VLOOKUP(J59,Entries!$A:$D,4,0),\"-\")","v":"-"},{"$f":"IFERROR(VLOOKUP(J59,Entries!$A:$H,8,0),\"-\")","v":"-"},{"$f":"IFERROR(VLOOKUP(J59,Entries!$A:$F,6,0),\"-\")","v":"-"}]
[6,null,{"$f":"IFERROR(VLOOKUP(B60,Entries!$A:$E,5,0),\"-\")","v":"-"},{"$f":"IFERROR(VLOOKUP(B60,Entries!$A:$D,4,0),\"-\")","v":"-"},{"$f":"IFERROR(VLOOKUP(B60,Entries!$A:$H,8,0),\"-\")","v":"-"},{"$f":"IFERROR(VLOOKUP(B60,Entries!$A:$F,6,0),\"-\")","v":"-"},null,null,6,null,{"$f":"IFERROR(VLOOKUP(J60,Entries!$A:$E,5,0),\"-\")","v":"-"},{"$f":"IFERROR(VLOOKUP(J60,Entries!$A:$D,4,0),\"-\")","v":"-"},{"$f":"IFERROR(VLOOKUP(J60,Entries!$A:$H,8,0),\"-\")","v":"-"},{"$f":"IFERROR(VLOOKUP(J60,Entries!$A:$F,6,0),\"-\")","v":"-"}]
[7,null,{"$f":"IFERROR(VLOOKUP(B61,Entries!$A:$E,5,0),\"-\")","v":"-"},{"$f":"IFERROR(VLOOKUP(B61,Entries!$A:$D,4,0),\"-\")","v":"-"},{"$f":"IFERROR(VLOOKUP(B61,Entries!$A:$H,8,0),\"-\")","v":"-"},{"$f":"IFERROR(VLOOKUP(B61,Entries!$A:$F,6,0),\"-\")","v":"-"},null,null,7,null,{"$f":"IFERROR(VLOOKUP(J61,Entries!$A:$E,5,0),\"-\")","v":"-"},{"$f":"IFERROR(VLOOKUP(J61,Entries!$A:$D,4,0),\"-\")","v":"-"},{"$f":"IFERROR(VLOOKUP(J61,Entries!$A:$H,8,0),\"-\")","v":"-"},{"$f":"IFERROR(VLOOKUP(J61,Entries!$A:$F,6,0),\"-\")","v":"-"}]
[8,null,{"$f":"IFERROR(VLOOKUP(B62,Entries!$A:$E,5,0),\"-\")","v":"-"},{"$f":"IFERROR(VLOOKUP(B62,Entries!$A:$D,4,0),\"-\")","v":"-"},{"$f":"IFERROR(VLOOKUP(B62,Entries!$A:$H,8,0),\"-\")","v":"-"},{"$f":"IFERROR(VLOOKUP(B62,Entries!$A:$F,6,0),\"-\")","v":"-"},null,null,8,null,{"$f":"IFERROR(VLOOKUP(J62,Entries!$A:$E,5,0),\"-\")","v":"-"},{"$f":"IFERROR(VLOOKUP(J62,Entries!$A:$D,4,0),\"-\")","v":"-"},{"$f":"IFERROR(VLOOKUP(J62,Entries!$A:$H,8,0),\"-\")","v":"-"},{"$f":"IFERROR(VLOOKUP(J62,Entries!$A:$F,6,0),\"-\")","v":"-"}]
[9,null,{"$f":"IFERROR(VLOOKUP(B63,Entries!$A:$E,5,0),\"-\")","v":"-"},{"$f":"IFERROR(VLOOKUP(B63,Entries!$A:$D,4,0),\"-\")","v":"-"},{"$f":"IFERROR(VLOOKUP(B63,Entries!$A:$H,8,0),\"-\")","v":"-"},{"$f":"IFERROR(VLOOKUP(B63,Entries!$A:$F,6,0),\"-\")","v":"-"},null,null,9,null,{"$f":"IFERROR(VLOOKUP(J63,Entries!$A:$E,5,0),\"-\")","v":"-"},{"$f":"IFERROR(VLOOKUP(J63,Entries!$A:$D,4,0),\"-\")","v":"-"},{"$f":"IFERROR(VLOOKUP(J63,Entries!$A:$H,8,0),\"-\")","v":"-"},{"$f":"IFERROR(VLOOKUP(J63,Entries!$A:$F,6,0),\"-\")","v":"-"}]
[10,null,{"$f":"IFERROR(VLOOKUP(B64,Entries!$A:$E,5,0),\"-\")","v":"-"},{"$f":"IFERROR(VLOOKUP(B64,Entries!$A:$D,4,0),\"-\")","v":"-"},{"$f":"IFERROR(VLOOKUP(B64,Entries!$A:$H,8,0),\"-\")","v":"-"},{"$f":"IFERROR(VLOOKUP(B64,Entries!$A:$F,6,0),\"-\")","v":"-"},null,null,10,null,{"$f":"IFERROR(VLOOKUP(J64,Entries!$A:$E,5,0),\"-\")","v":"-"},{"$f":"IFERROR(VLOOKUP(J64,Entries!$A:$D,4,0),\"-\")","v":"-"},{"$f":"IFERROR(VLOOKUP(J64,Entries!$A:$H,8,0),\"-\")","v":"-"},{"$f":"IFERROR(VLOOKUP(J64,Entries!$A:$F,6,0),\"-\")","v":"-"}]
[]
["Veteran Men",null,null,null,null,"Wind",-4]
["Pos","Number","Last Name","First Name","Age","Club","Time",null,"U17 Women",null,null,null,null,"Wind"]
[1,209,{"$f":"IFERROR(VLOOKUP(B68,Entries!$A:$E,5,0),\"-\")","v":"William"},{"$f":"IFERROR(VLOOKUP(B68,Entries!$A:$D,4,0),\"-\")","v":"Bernard"},{"$f":"IFERROR(VLOOKUP(B68,Entries!$A:$H,8,0),\"-\")","v":35},{"$f":"IFERROR(VLOOKUP(B68,Entries!$A:$F,6,0),\"-\")","v":"JBR Run and Tri Club"},"30.28",null,"Pos","Number","Last Name","First Name","Age","Club","Time"]
[2,343,{"$f":"IFERROR(VLOOKUP(B69,Entries!$A:$E,5,0),\"-\")","v":"Berrett"},{"$f":"IFERROR(VLOOKUP(B69,Entries!$A:$D,4,0),\"-\")","v":"Paul"},{"$f":"IFERROR(VLOOKUP(B69,Entries!$A:$H,8,0),\"-\")","v":62},{"$f":"IFERROR(VLOOKUP(B69,Entries!$A:$F,6,0),\"-\")","v":"Havering AC"},"31.41",null,1,20,{"$f":"IFERROR(VLOOKUP(J69,Entries!$A:$E,5,0),\"-\")","v":"Frisby"},{"$f":"IFERROR(VLOOKUP(J69,Entries!$A:$D,4,0),\"-\")","v":"Erin"},{"$f":"IFERROR(VLOOKUP(J69,Entries!$A:$H,8,0),\"-\")","v":15},{"$f":"IFERROR(VLOOKUP(J69,Entries!$A:$F,6,0),\"-\")","v":"City of Southend On Sea AC"},"27.9"]
[3,null,{"$f":"IFERROR(VLOOKUP(B70,Entries!$A:$E,5,0),\"-\")","v":"-"},{"$f":"IFERROR(VLOOKUP(B70,Entries!$A:$D,4,0),\"-\")","v":"-"},{"$f":"IFERROR(VLOOKUP(B70,Entries!$A:$H,8,0),\"-\")","v":"-"},{"$f":"IFERROR(VLOOKUP(B70,Entries!$A:$F,6,0),\"-\")","v":"-"},null,null,2,null,{"$f":"IFERROR(VLOOKUP(J70,Entries!$A:$E,5,0),\"-\")","v":"-"},{"$f":"IFERROR(VLOOKUP(J70,Entries!$A:$D,4,0),\"-\")","v":"-"},{"$f":"IFERROR(VLOOKUP(J70,Entries!$A:$H,8,0),\"-\")","v":"-"},{"$f":"IFERROR(VLOOKUP(J70,Entries!$A:$F,6,0),\"-\")","v":"-"}]
[4,null,{"$f":"IFERROR(VLOOKUP(B71,Entries!$A:$E,5,0),\"-\")","v":"-"},{"$f":"IFERROR(VLOOKUP(B71,Entries!$A:$D,4,0),\"-\")","v":"-"},{"$f":"IFERROR(VLOOKUP(B71,Entries!$A:$H,8,0),\"-\")","v":"-"},{"$f":"IFERROR(VLOOKUP(B71,Entries!$A:$F,6,0),\"-\")","v":"-"},null,null,3,null,{"$f":"IFERROR(VLOOKUP(J71,Entries!$A:$E,5,0),\"-\")","v":"-"},{"$f":"IFERROR(VLOOKUP(J71,Entries!$A:$D,4,0),\"-\")","v":"-"},{"$f":"IFERROR(VLOOKUP(J71,Entries!$A:$H,8,0),\"-\")","v":"-"},{"$f":"IFERROR(VLOOKUP(J71,Entries!$A:$F,6,0),\"-\")","v":"-"}]
[5,null,{"$f":"IFERROR(VLOOKUP(B72,Entries!$A:$E,5,0),\"-\")","v":"-"},{"$f":"IFERROR(VLOOKUP(B72,Entries!$A:$D,4,0),\"-\")","v":"-"},{"$f":"IFERROR(VLOOKUP(B72,Entries!$A:$H,8,0),\"-\")","v":"-"},{"$f":"IFERROR(VLOOKUP(B72,Entries!$A:$F,6,0),\"-\")","v":"-"},null,null,4,null,{"$f":"IFERROR(VLOOKUP(J72,Entries!$A:$E,5,0),\"-\")","v":"-"},{"$f":"IFERROR(VLOOKUP(J72,Entries!$A:$D,4,0),\"-\")","v":"-"},{"$f":"IFERROR(VLOOKUP(J72,Entries!$A:$H,8,0),\"-\")","v":"-"},{"$f":"IFERROR(VLOOKUP(J72,Entries!$A:$F,6,0),\"-\")","v":"-"}]
[6,null,{"$f":"IFERROR(VLOOKUP(B73,Entries!$A:$E,5,0),\"-\")","v":"-"},{"$f":"IFERROR(VLOOKUP(B73,Entries!$A:$D,4,0),\"-\")","v":"-"},{"$f":"IFERROR(VLOOKUP(B73,Entries!$A:$H,8,0),\"-\")","v":"-"},{"$f":"IFERROR(VLOOKUP(B73,Entries!$A:$F,6,0),\"-\")","v":"-"},null,null,5,null,{"$f":"IFERROR(VLOOKUP(J73,Entries!$A:$E,5,0),\"-\")","v":"-"},{"$f":"IFERROR(VLOOKUP(J73,Entries!$A:$D,4,0),\"-\")","v":"-"},{"$f":"IFERROR(VLOOKUP(J73,Entries!$A:$H,8,0),\"-\")","v":"-"},{"$f":"IFERROR(VLOOKUP(J73,Entries!$A:$F,6,0),\"-\")","v":"-"}]
[7,null,{"$f":"IFERROR(VLOOKUP(B74,Entries!$A:$E,5,0),\"-\")","v":"-"},{"$f":"IFERROR(VLOOKUP(B74,Entries!$A:$D,4,0),\"-\")","v":"-"},{"$f":"IFERROR(VLOOKUP(B74,Entries!$A:$H,8,0),\"-\")","v":"-"},{"$f":"IFERROR(VLOOKUP(B74,Entries!$A:$F,6,0),\"-\")","v":"-"},null,null,6,null,{"$f":"IFERROR(VLOOKUP(J74,Entries!$A:$E,5,0),\"-\")","v":"-"},{"$f":"IFERROR(VLOOKUP(J74,Entries!$A:$D,4,0),\"-\")","v":"-"},{"$f":"IFERROR(VLOOKUP(J74,Entries!$A:$H,8,0),\"-\")","v":"-"},{"$f":"IFERROR(VLOOKUP(J74,Entries!$A:$F,6,0),\"-\")","v":"-"}]
[8,null,{"$f":"IFERROR(VLOOKUP(B75,Entries!$A:$E,5,0),\"-\")","v":"-"},{"$f":"IFERROR(VLOOKUP(B75,Entries!$A:$D,4,0),\"-\")","v":"-"},{"$f":"IFERROR(VLOOKUP(B75,Entries!$A:$H,8,0),\"-\")","v":"-"},{"$f":"IFERROR(VLOOKUP(B75,Entries!$A:$F,6,0),\"-\")","v":"-"},null,null,7,null,{"$f":"IFERROR(VLOOKUP(J75,Entries!$A:$E,5,0),\"-\")","v":"-"},{"$f":"IFERROR(VLOOKUP(J75,Entries!$A:$D,4,0),\"-\")","v":"-"},{"$f":"IFERROR(VLOOKUP(J75,Entries!$A:$H,8,0),\"-\")","v":"-"},{"$f":"IFERROR(VLOOKUP(J75,Entries!$A:$F,6,0),\"-\")","v":"-"}]
[9,null,{"$f":"IFERROR(VLOOKUP(B76,Entries!$A:$E,5,0),\"-\")","v":"-"},{"$f":"IFERROR(VLOOKUP(B76,Entries!$A:$D,4,0),\"-\")","v":"-"},{"$f":"IFERROR(VLOOKUP(B76,Entries!$A:$H,8,0),\"-\")","v":"-"},{"$f":"IFERROR(VLOOKUP(B76,Entries!$A:$F,6,0),\"-\")","v":"-"},null,null,8,null,{"$f":"IFERROR(VLOOKUP(J76,Entries!$A:$E,5,0),\"-\")","v":"-"},{"$f":"IFERROR(VLOOKUP(J76,Entries!$A:$D,4,0),\"-\")","v":"-"},{"$f":"IFERROR(VLOOKUP(J76,Entries!$A:$H,8,0),\"-\")","v":"-"},{"$f":"IFERROR(VLOOKUP(J76,Entries!$A:$F,6,0),\"-\")","v":"-"}]
[10,null,{"$f":"IFERROR(VLOOKUP(B77,Entries!$A:$E,5,0),\"-\")","v":"-"},{"$f":"IFERROR(VLOOKUP(B77,Entries!$A:$D,4,0),\"-\")","v":"-"},{"$f":"IFERROR(VLOOKUP(B77,Entries!$A:$H,8,0),\"-\")","v":"-"},{"$f":"IFERROR(VLOOKUP(B77,Entries!$A:$F,6,0),\"-\")","v":"-"}]
[]
[]
[null,null,null,null,null,null,null,null,"Senior Women",null,null,null,null,"Wind"]
[null,null,null,null,null,null,null,null,"Pos","Number","Last Name","First Name","Age","Club","Time"]
[null,null,null,null,null,null,null,null,1,128,{"$f":"IFERROR(VLOOKUP(J82,Entries!$A:$E,5,0),\"-\")","v":"Staines"},{"$f":"IFERROR(VLOOKUP(J82,Entries!$A:$D,4,0),\"-\")","v":"Victoria"},{"$f":"IFERROR(VLOOKUP(J82,Entries!$A:$H,8,0),\"-\")","v":27},{"$f":"IFERROR(VLOOKUP(J82,Entries!$A:$F,6,0),\"-\")","v":"City of Southend On Sea AC"},"30.6"]
[null,null,null,null,null,null,null,null,2,231,{"$f":"IFERROR(VLOOKUP(J83,Entries!$A:$E,5,0),\"-\")","v":"Hopper"},{"$f":"IFERROR(VLOOKUP(J83,Entries!$A:$D,4,0),\"-\")","v":"Laura"},{"$f":"IFERROR(VLOOKUP(J83,Entries!$A:$H,8,0),\"-\")","v":23},{"$f":"IFERROR(VLOOKUP(J83,Entries!$A:$F,6,0),\"-\")","v":"London City Runners"},"34.0"]
[null,null,null,null,null,null,null,null,3,null,{"$f":"IFERROR(VLOOKUP(J84,Entries!$A:$E,5,0),\"-\")","v":"-"},{"$f":"IFERROR(VLOOKUP(J84,Entries!$A:$D,4,0),\"-\")","v":"-"},{"$f":"IFERROR(VLOOKUP(J84,Entries!$A:$H,8,0),\"-\")","v":"-"},{"$f":"IFERROR(VLOOKUP(J84,Entries!$A:$F,6,0),\"-\")","v":"-"}]
[null,null,null,null,null,null,null,null,4,null,{"$f":"IFERROR(VLOOKUP(J85,Entries!$A:$E,5,0),\"-\")","v":"-"},{"$f":"IFERROR(VLOOKUP(J85,Entries!$A:$D,4,0),\"-\")","v":"-"},{"$f":"IFERROR(VLOOKUP(J85,Entries!$A:$H,8,0),\"-\")","v":"-"},{"$f":"IFERROR(VLOOKUP(J85,Entries!$A:$F,6,0),\"-\")","v":"-"}]
[null,null,null,null,null,null,null,null,5,null,{"$f":"IFERROR(VLOOKUP(J86,Entries!$A:$E,5,0),\"-\")","v":"-"},{"$f":"IFERROR(VLOOKUP(J86,Entries!$A:$D,4,0),\"-\")","v":"-"},{"$f":"IFERROR(VLOOKUP(J86,Entries!$A:$H,8,0),\"-\")","v":"-"},{"$f":"IFERROR(VLOOKUP(J86,Entries!$A:$F,6,0),\"-\")","v":"-"}]
[null,null,null,null,null,null,null,null,6,null,{"$f":"IFERROR(VLOOKUP(J87,Entries!$A:$E,5,0),\"-\")","v":"-"},{"$f":"IFERROR(VLOOKUP(J87,Entries!$A:$D,4,0),\"-\")","v":"-"},{"$f":"IFERROR(VLOOKUP(J87,Entries!$A:$H,8,0),\"-\")","v":"-"},{"$f":"IFERROR(VLOOKUP(J87,Entries!$A:$F,6,0),\"-\")","v":"-"}]
[null,null,null,null,null,null,null,null,7,null,{"$f":"IFERROR(VLOOKUP(J88,Entries!$A:$E,5,0),\"-\")","v":"-"},{"$f":"IFERROR(VLOOKUP(J88,Entries!$A:$D,4,0),\"-\")","v":"-"},{"$f":"IFERROR(VLOOKUP(J88,Entries!$A:$H,8,0),\"-\")","v":"-"},{"$f":"IFERROR(VLOOKUP(J88,Entries!$A:$F,6,0),\"-\")","v":"-"}]
[null,null,null,null,null,null,null,null,8,null,{"$f":"IFERROR(VLOOKUP(J89,Entries!$A:$E,5,0),\"-\")","v":"-"},{"$f":"IFERROR(VLOOKUP(J89,Entries!$A:$D,4,0),\"-\")","v":"-"},{"$f":"IFERROR(VLOOKUP(J89,Entries!$A:$H,8,0),\"-\")","v":"-"},{"$f":"IFERROR(VLOOKUP(J89,Entries!$A:$F,6,0),\"-\")","v":"-"}]
[]
[]
[null,null,null,null,null,null,null,null,"Veteran Women",null,null,null,null,"Wind"]
[null,null,null,null,null,null,null,null,"Pos","Number","Last Name","First Name","Age","Club","Time"]
[null,null,null,null,null,null,null,null,1,345,{"$f":"IFERROR(VLOOKUP(J94,Entries!$A:$E,5,0),\"-\")","v":"Donnelly"},{"$f":"IFERROR(VLOOKUP(J94,Entries!$A:$D,4,0),\"-\")","v":"Linda"},{"$f":"IFERROR(VLOOKUP(J94,Entries!$A:$H,8,0),\"-\")","v":66},{"$f":"IFERROR(VLOOKUP(J94,Entries!$A:$F,6,0),\"-\")","v":"City of Southend On Sea AC"},"46.9"]
[null,null,null,null,null,null,null,null,2,null,{"$f":"IFERROR(VLOOKUP(J95,Entries!$A:$E,5,0),\"-\")","v":"-"},{"$f":"IFERROR(VLOOKUP(J95,Entries!$A:$D,4,0),\"-\")","v":"-"},{"$f":"IFERROR(VLOOKUP(J95,Entries!$A:$H,8,0),\"-\")","v":"-"},{"$f":"IFERROR(VLOOKUP(J95,Entries!$A:$F,6,0),\"-\")","v":"-"}]
[null,null,null,null,null,null,null,null,3,null,{"$f":"IFERROR(VLOOKUP(J96,Entries!$A:$E,5,0),\"-\")","v":"-"},{"$f":"IFERROR(VLOOKUP(J96,Entries!$A:$D,4,0),\"-\")","v":"-"},{"$f":"IFERROR(VLOOKUP(J96,Entries!$A:$H,8,0),\"-\")","v":"-"},{"$f":"IFERROR(VLOOKUP(J96,Entries!$A:$F,6,0),\"-\")","v":"-"}]
[null,null,null,null,null,null,null,null,4,null,{"$f":"IFERROR(VLOOKUP(J97,Entries!$A:$E,5,0),\"-\")","v":"-"},{"$f":"IFERROR(VLOOKUP(J97,Entries!$A:$D,4,0),\"-\")","v":"-"},{"$f":"IFERROR(VLOOKUP(J97,Entries!$A:$H,8,0),\"-\")","v":"-"},{"$f":"IFERROR(VLOOKUP(J97,Entries!$A:$F,6,0),\"-\")","v":"-"}]
[null,null,null,null,null,null,null,null,5,null,{"$f":"IFERROR(VLOOKUP(J98,Entries!$A:$E,5,0),\"-\")","v":"-"},{"$f":"IFERROR(VLOOKUP(J98,Entries!$A:$D,4,0),\"-\")","v":"-"},{"$f":"IFERROR(VLOOKUP(J98,Entries!$A:$H,8,0),\"-\")","v":"-"},{"$f":"IFERROR(VLOOKUP(J98,Entries!$A:$F,6,0),\"-\")","v":"-"}]
[null,null,null,null,null,null,null,null,6,null,{"$f":"IFERROR(VLOOKUP(J99,Entries!$A:$E,5,0),\"-\")","v":"-"},{"$f":"IFERROR(VLOOKUP(J99,Entries!$A:$D,4,0),\"-\")","v":"-"},{"$f":"IFERROR(VLOOKUP(J99,Entries!$A:$H,8,0),\"-\")","v":"-"},{"$f":"IFERROR(VLOOKUP(J99,Entries!$A:$F,6,0),\"-\")","v":"-"}]
[null,null,null,null,null,null,null,null,7,null,{"$f":"IFERROR(VLOOKUP(J100,Entries!$A:$E,5,0),\"-\")","v":"-"},{"$f":"IFERROR(VLOOKUP(J100,Entries!$A:$D,4,0),\"-\")","v":"-"},{"$f":"IFERROR(VLOOKUP(J100,Entries!$A:$H,8,0),\"-\")","v":"-"},{"$f":"IFERROR(VLOOKUP(J100,Entries!$A:$F,6,0),\"-\")","v":"-"}]
[null,null,null,null,null,null,null,null,8,null,{"$f":"IFERROR(VLOOKUP(J101,Entries!$A:$E,5,0),\"-\")","v":"-"},{"$f":"IFERROR(VLOOKUP(J101,Entries!$A:$D,4,0),\"-\")","v":"-"},{"$f":"IFERROR(VLOOKUP(J101,Entries!$A:$H,8,0),\"-\")","v":"-"},{"$f":"IFERROR(VLOOKUP(J101,Entries!$A:$F,6,0),\"-\")","v":"-"}]
[null,null,null,null,null,null,null,null,9,null,{"$f":"IFERROR(VLOOKUP(J102,Entries!$A:$E,5,0),\"-\")","v":"-"},{"$f":"IFERROR(VLOOKUP(J102,Entries!$A:$D,4,0),\"-\")","v":"-"},{"$f":"IFERROR(VLOOKUP(J102,Entries!$A:$H,8,0),\"-\")","v":"-"},{"$f":"IFERROR(VLOOKUP(J102,Entries!$A:$F,6,0),\"-\")","v":"-"}]
[null,null,null,null,null,null,null,null,10,null,{"$f":"IFERROR(VLOOKUP(J103,Entries!$A:$E,5,0),\"-\")","v":"-"},{"$f":"IFERROR(VLOOKUP(J103,Entries!$A:$D,4,0),\"-\")","v":"-"},{"$f":"IFERROR(VLOOKUP(J103,Entries!$A:$H,8,0),\"-\")","v":"-"},{"$f":"IFERROR(VLOOKUP(J103,Entries!$A:$F,6,0),\"-\")","v":"-"}]

{"sheet":"300m","index":9,"n_rows":24,"n_cols":15,"rows_kept":24,"cut":false,"hidden":false,"merged":[]}
["300m"]
[]
["U15 Boys",null,null,null,null,null,null,null,"U15 Girls"]
["Pos","Number","Last Name","First Name","Age","Club","Time",null,"Pos","Number","Last Name","First Name","Age","Club","Time"]
[1,63,{"$f":"IFERROR(VLOOKUP(B5,Entries!$A:$E,5,0),\"-\")","v":"Hill"},{"$f":"IFERROR(VLOOKUP(B5,Entries!$A:$D,4,0),\"-\")","v":"George"},{"$f":"IFERROR(VLOOKUP(B5,Entries!$A:$H,8,0),\"-\")","v":13},{"$f":"IFERROR(VLOOKUP(B5,Entries!$A:$F,6,0),\"-\")","v":"City of Southend On Sea AC"},"43.34",null,1,62,{"$f":"IFERROR(VLOOKUP(J5,Entries!$A:$E,5,0),\"-\")","v":"Barker"},{"$f":"IFERROR(VLOOKUP(J5,Entries!$A:$D,4,0),\"-\")","v":"Isla"},{"$f":"IFERROR(VLOOKUP(J5,Entries!$A:$H,8,0),\"-\")","v":14},{"$f":"IFERROR(VLOOKUP(J5,Entries!$A:$F,6,0),\"-\")","v":"Ipswich Harriers"},"43.33"]
[2,250,{"$f":"IFERROR(VLOOKUP(B6,Entries!$A:$E,5,0),\"-\")","v":"Weston"},{"$f":"IFERROR(VLOOKUP(B6,Entries!$A:$D,4,0),\"-\")","v":"Jack"},{"$f":"IFERROR(VLOOKUP(B6,Entries!$A:$H,8,0),\"-\")","v":14},{"$f":"IFERROR(VLOOKUP(B6,Entries!$A:$F,6,0),\"-\")","v":"Basildon AC"},"43.98",null,2,234,{"$f":"IFERROR(VLOOKUP(J6,Entries!$A:$E,5,0),\"-\")","v":"Carter"},{"$f":"IFERROR(VLOOKUP(J6,Entries!$A:$D,4,0),\"-\")","v":"Ava"},{"$f":"IFERROR(VLOOKUP(J6,Entries!$A:$H,8,0),\"-\")","v":14},{"$f":"IFERROR(VLOOKUP(J6,Entries!$A:$F,6,0),\"-\")","v":"Brentwood Beagles Athletics Club"},"43.53"]
[3,251,{"$f":"IFERROR(VLOOKUP(B7,Entries!$A:$E,5,0),\"-\")","v":"Jones"},{"$f":"IFERROR(VLOOKUP(B7,Entries!$A:$D,4,0),\"-\")","v":"Matthew"},{"$f":"IFERROR(VLOOKUP(B7,Entries!$A:$H,8,0),\"-\")","v":14},{"$f":"IFERROR(VLOOKUP(B7,Entries!$A:$F,6,0),\"-\")","v":"Brentwood Beagles Athletics Club"},"49.20",null,3,215,{"$f":"IFERROR(VLOOKUP(J7,Entries!$A:$E,5,0),\"-\")","v":"Hawkins"},{"$f":"IFERROR(VLOOKUP(J7,Entries!$A:$D,4,0),\"-\")","v":"Nicole"},{"$f":"IFERROR(VLOOKUP(J7,Entries!$A:$H,8,0),\"-\")","v":14},{"$f":"IFERROR(VLOOKUP(J7,Entries!$A:$F,6,0),\"-\")","v":"Brentwood Beagles Athletics Club"},"43.73"]
[4,null,{"$f":"IFERROR(VLOOKUP(B8,Entries!$A:$E,5,0),\"-\")","v":"-"},{"$f":"IFERROR(VLOOKUP(B8,Entries!$A:$D,4,0),\"-\")","v":"-"},{"$f":"IFERROR(VLOOKUP(B8,Entries!$A:$H,8,0),\"-\")","v":"-"},{"$f":"IFERROR(VLOOKUP(B8,Entries!$A:$F,6,0),\"-\")","v":"-"},null,null,4,23,{"$f":"IFERROR(VLOOKUP(J8,Entries!$A:$E,5,0),\"-\")","v":"Eze"},{"$f":"IFERROR(VLOOKUP(J8,Entries!$A:$D,4,0),\"-\")","v":"Evanna"},{"$f":"IFERROR(VLOOKUP(J8,Entries!$A:$H,8,0),\"-\")","v":14},{"$f":"IFERROR(VLOOKUP(J8,Entries!$A:$F,6,0),\"-\")","v":"Woodford Green AC with Essex Ladies"},"45.76"]
[5,null,{"$f":"IFERROR(VLOOKUP(B9,Entries!$A:$E,5,0),\"-\")","v":"-"},{"$f":"IFERROR(VLOOKUP(B9,Entries!$A:$D,4,0),\"-\")","v":"-"},{"$f":"IFERROR(VLOOKUP(B9,Entries!$A:$H,8,0),\"-\")","v":"-"},{"$f":"IFERROR(VLOOKUP(B9,Entries!$A:$F,6,0),\"-\")","v":"-"},null,null,5,64,{"$f":"IFERROR(VLOOKUP(J9,Entries!$A:$E,5,0),\"-\")","v":"McCart"},{"$f":"IFERROR(VLOOKUP(J9,Entries!$A:$D,4,0),\"-\")","v":"Harriet"},{"$f":"IFERROR(VLOOKUP(J9,Entries!$A:$H,8,0),\"-\")","v":14},{"$f":"IFERROR(VLOOKUP(J9,Entries!$A:$F,6,0),\"-\")","v":"Ipswich Jaffa RC"},"46.04"]
[6,null,{"$f":"IFERROR(VLOOKUP(B10,Entries!$A:$E,5,0),\"-\")","v":"-"},{"$f":"IFERROR(VLOOKUP(B10,Entries!$A:$D,4,0),\"-\")","v":"-"},{"$f":"IFERROR(VLOOKUP(B10,Entries!$A:$H,8,0),\"-\")","v":"-"},{"$f":"IFERROR(VLOOKUP(B10,Entries!$A:$F,6,0),\"-\")","v":"-"},null,null,6,293,{"$f":"IFERROR(VLOOKUP(J10,Entries!$A:$E,5,0),\"-\")","v":"May"},{"$f":"IFERROR(VLOOKUP(J10,Entries!$A:$D,4,0),\"-\")","v":"Martha"},{"$f":"IFERROR(VLOOKUP(J10,Entries!$A:$H,8,0),\"-\")","v":14},{"$f":"IFERROR(VLOOKUP(J10,Entries!$A:$F,6,0),\"-\")","v":"Braintree & District AC"},"46.34"]
[7,null,{"$f":"IFERROR(VLOOKUP(B11,Entries!$A:$E,5,0),\"-\")","v":"-"},{"$f":"IFERROR(VLOOKUP(B11,Entries!$A:$D,4,0),\"-\")","v":"-"},{"$f":"IFERROR(VLOOKUP(B11,Entries!$A:$H,8,0),\"-\")","v":"-"},{"$f":"IFERROR(VLOOKUP(B11,Entries!$A:$F,6,0),\"-\")","v":"-"},null,null,7,58,{"$f":"IFERROR(VLOOKUP(J11,Entries!$A:$E,5,0),\"-\")","v":"Gray"},{"$f":"IFERROR(VLOOKUP(J11,Entries!$A:$D,4,0),\"-\")","v":"Amalia"},{"$f":"IFERROR(VLOOKUP(J11,Entries!$A:$H,8,0),\"-\")","v":14},{"$f":"IFERROR(VLOOKUP(J11,Entries!$A:$F,6,0),\"-\")","v":"City of Southend On Sea AC"},"46.92"]
[8,null,{"$f":"IFERROR(VLOOKUP(B12,Entries!$A:$E,5,0),\"-\")","v":"-"},{"$f":"IFERROR(VLOOKUP(B12,Entries!$A:$D,4,0),\"-\")","v":"-"},{"$f":"IFERROR(VLOOKUP(B12,Entries!$A:$H,8,0),\"-\")","v":"-"},{"$f":"IFERROR(VLOOKUP(B12,Entries!$A:$F,6,0),\"-\")","v":"-"},null,null,8,null,{"$f":"IFERROR(VLOOKUP(J12,Entries!$A:$E,5,0),\"-\")","v":"-"},{"$f":"IFERROR(VLOOKUP(J12,Entries!$A:$D,4,0),\"-\")","v":"-"},{"$f":"IFERROR(VLOOKUP(J12,Entries!$A:$H,8,0),\"-\")","v":"-"},{"$f":"IFERROR(VLOOKUP(J12,Entries!$A:$F,6,0),\"-\")","v":"-"}]
[]
[]
[null,null,null,null,null,null,null,null,"U17 Women"]
[null,null,null,null,null,null,null,null,"Pos","Number","Last Name","First Name","Age","Club","Time"]
[null,null,null,null,null,null,null,null,1,24,{"$f":"IFERROR(VLOOKUP(J17,Entries!$A:$E,5,0),\"-\")","v":"Mosanya"},{"$f":"IFERROR(VLOOKUP(J17,Entries!$A:$D,4,0),\"-\")","v":"Evie-Mae"},{"$f":"IFERROR(VLOOKUP(J17,Entries!$A:$H,8,0),\"-\")","v":15},{"$f":"IFERROR(VLOOKUP(J17,Entries!$A:$F,6,0),\"-\")","v":"Woodford Green AC with Essex Ladies"},"43.83"]
[null,null,null,null,null,null,null,null,2,290,{"$f":"IFERROR(VLOOKUP(J18,Entries!$A:$E,5,0),\"-\")","v":"Walker"},{"$f":"IFERROR(VLOOKUP(J18,Entries!$A:$D,4,0),\"-\")","v":"Jessica"},{"$f":"IFERROR(VLOOKUP(J18,Entries!$A:$H,8,0),\"-\")","v":15},{"$f":"IFERROR(VLOOKUP(J18,Entries!$A:$F,6,0),\"-\")","v":"City of Southend On Sea AC"},"44.22"]
[null,null,null,null,null,null,null,null,3,57,{"$f":"IFERROR(VLOOKUP(J19,Entries!$A:$E,5,0),\"-\")","v":"Fotherby"},{"$f":"IFERROR(VLOOKUP(J19,Entries!$A:$D,4,0),\"-\")","v":"Chloe"},{"$f":"IFERROR(VLOOKUP(J19,Entries!$A:$H,8,0),\"-\")","v":15},{"$f":"IFERROR(VLOOKUP(J19,Entries!$A:$F,6,0),\"-\")","v":"City of Southend On Sea AC"},"46.18"]
[null,null,null,null,null,null,null,null,4,233,{"$f":"IFERROR(VLOOKUP(J20,Entries!$A:$E,5,0),\"-\")","v":"Oladele"},{"$f":"IFERROR(VLOOKUP(J20,Entries!$A:$D,4,0),\"-\")","v":"Dasia"},{"$f":"IFERROR(VLOOKUP(J20,Entries!$A:$H,8,0),\"-\")","v":15},{"$f":"IFERROR(VLOOKUP(J20,Entries!$A:$F,6,0),\"-\")","v":"Thurrock Harriers"},"52.29"]
[null,null,null,null,null,null,null,null,5,null,{"$f":"IFERROR(VLOOKUP(J21,Entries!$A:$E,5,0),\"-\")","v":"-"},{"$f":"IFERROR(VLOOKUP(J21,Entries!$A:$D,4,0),\"-\")","v":"-"},{"$f":"IFERROR(VLOOKUP(J21,Entries!$A:$H,8,0),\"-\")","v":"-"},{"$f":"IFERROR(VLOOKUP(J21,Entries!$A:$F,6,0),\"-\")","v":"-"}]
[null,null,null,null,null,null,null,null,6,null,{"$f":"IFERROR(VLOOKUP(J22,Entries!$A:$E,5,0),\"-\")","v":"-"},{"$f":"IFERROR(VLOOKUP(J22,Entries!$A:$D,4,0),\"-\")","v":"-"},{"$f":"IFERROR(VLOOKUP(J22,Entries!$A:$H,8,0),\"-\")","v":"-"},{"$f":"IFERROR(VLOOKUP(J22,Entries!$A:$F,6,0),\"-\")","v":"-"}]
[null,null,null,null,null,null,null,null,7,null,{"$f":"IFERROR(VLOOKUP(J23,Entries!$A:$E,5,0),\"-\")","v":"-"},{"$f":"IFERROR(VLOOKUP(J23,Entries!$A:$D,4,0),\"-\")","v":"-"},{"$f":"IFERROR(VLOOKUP(J23,Entries!$A:$H,8,0),\"-\")","v":"-"},{"$f":"IFERROR(VLOOKUP(J23,Entries!$A:$F,6,0),\"-\")","v":"-"}]
[null,null,null,null,null,null,null,null,8,null,{"$f":"IFERROR(VLOOKUP(J24,Entries!$A:$E,5,0),\"-\")","v":"-"},{"$f":"IFERROR(VLOOKUP(J24,Entries!$A:$D,4,0),\"-\")","v":"-"},{"$f":"IFERROR(VLOOKUP(J24,Entries!$A:$H,8,0),\"-\")","v":"-"},{"$f":"IFERROR(VLOOKUP(J24,Entries!$A:$F,6,0),\"-\")","v":"-"}]

{"sheet":"400m","index":10,"n_rows":64,"n_cols":19,"rows_kept":64,"cut":false,"hidden":false,"merged":[]}
["400m"]
[]
["U9B",null,null,null,null,null,null,null,null,null,"U9G Heat 1"]
["Pos","Number","Last Name","First Name","Age","Club","Time",null,null,null,"Pos","Number","Last Name","First Name","Age","Club","Time"]
[1,142,{"$f":"IFERROR(VLOOKUP(B5,Entries!$A:$E,5,0),\"-\")","v":"Pearce"},{"$f":"IFERROR(VLOOKUP(B5,Entries!$A:$D,4,0),\"-\")","v":"Jake"},{"$f":"IFERROR(VLOOKUP(B5,Entries!$A:$H,8,0),\"-\")","v":8},{"$f":"IFERROR(VLOOKUP(B5,Entries!$A:$F,6,0),\"-\")","v":"SS Athletics"},"1.15.3",null,null,null,1,194,{"$f":"IFERROR(VLOOKUP(L5,Entries!$A:$E,5,0),\"-\")","v":"Cassidy-George"},{"$f":"IFERROR(VLOOKUP(L5,Entries!$A:$D,4,0),\"-\")","v":"Lois"},{"$f":"IFERROR(VLOOKUP(L5,Entries!$A:$H,8,0),\"-\")","v":8},{"$f":"IFERROR(VLOOKUP(L5,Entries!$A:$F,6,0),\"-\")","v":"SS Athletics"},"1.20.65"]
[2,152,{"$f":"IFERROR(VLOOKUP(B6,Entries!$A:$E,5,0),\"-\")","v":"Finnegan"},{"$f":"IFERROR(VLOOKUP(B6,Entries!$A:$D,4,0),\"-\")","v":"Teddy"},{"$f":"IFERROR(VLOOKUP(B6,Entries!$A:$H,8,0),\"-\")","v":8},{"$f":"IFERROR(VLOOKUP(B6,Entries!$A:$F,6,0),\"-\")","v":"SS Athletics"},"1.16.2",null,null,null,2,90,{"$f":"IFERROR(VLOOKUP(L6,Entries!$A:$E,5,0),\"-\")","v":"Foy"},{"$f":"IFERROR(VLOOKUP(L6,Entries!$A:$D,4,0),\"-\")","v":"Rosie"},{"$f":"IFERROR(VLOOKUP(L6,Entries!$A:$H,8,0),\"-\")","v":8},{"$f":"IFERROR(VLOOKUP(L6,Entries!$A:$F,6,0),\"-\")","v":"SS Athletics"},"1.24.65"]
[3,127,{"$f":"IFERROR(VLOOKUP(B7,Entries!$A:$E,5,0),\"-\")","v":"Hibbert"},{"$f":"IFERROR(VLOOKUP(B7,Entries!$A:$D,4,0),\"-\")","v":"Jael"},{"$f":"IFERROR(VLOOKUP(B7,Entries!$A:$H,8,0),\"-\")","v":7},{"$f":"IFERROR(VLOOKUP(B7,Entries!$A:$F,6,0),\"-\")","v":"Brentwood Beagles Athletics Club"},"1.21.2",null,null,null,3,143,{"$f":"IFERROR(VLOOKUP(L7,Entries!$A:$E,5,0),\"-\")","v":"Pearce"},{"$f":"IFERROR(VLOOKUP(L7,Entries!$A:$D,4,0),\"-\")","v":"Olivia"},{"$f":"IFERROR(VLOOKUP(L7,Entries!$A:$H,8,0),\"-\")","v":8},{"$f":"IFERROR(VLOOKUP(L7,Entries!$A:$F,6,0),\"-\")","v":"SS Athletics"},"1.27.48"]
[4,277,{"$f":"IFERROR(VLOOKUP(B8,Entries!$A:$E,5,0),\"-\")","v":"Care"},{"$f":"IFERROR(VLOOKUP(B8,Entries!$A:$D,4,0),\"-\")","v":"George"},{"$f":"IFERROR(VLOOKUP(B8,Entries!$A:$H,8,0),\"-\")","v":8},{"$f":"IFERROR(VLOOKUP(B8,Entries!$A:$F,6,0),\"-\")","v":"SS Athletics"},"1.21.2",null,null,null,4,363,{"$f":"IFERROR(VLOOKUP(L8,Entries!$A:$E,5,0),\"-\")","v":"Gosling"},{"$f":"IFERROR(VLOOKUP(L8,Entries!$A:$D,4,0),\"-\")","v":"Elise"},{"$f":"IFERROR(VLOOKUP(L8,Entries!$A:$H,8,0),\"-\")","v":8},{"$f":"IFERROR(VLOOKUP(L8,Entries!$A:$F,6,0),\"-\")","v":"Brentwood Beagles Athletics Club"},"1.28.75"]
[5,267,{"$f":"IFERROR(VLOOKUP(B9,Entries!$A:$E,5,0),\"-\")","v":"Tubman"},{"$f":"IFERROR(VLOOKUP(B9,Entries!$A:$D,4,0),\"-\")","v":"Tristan"},{"$f":"IFERROR(VLOOKUP(B9,Entries!$A:$H,8,0),\"-\")","v":8},{"$f":"IFERROR(VLOOKUP(B9,Entries!$A:$F,6,0),\"-\")","v":"City of Southend On Sea AC"},"1.23.5",null,null,null,5,336,{"$f":"IFERROR(VLOOKUP(L9,Entries!$A:$E,5,0),\"-\")","v":"Smith"},{"$f":"IFERROR(VLOOKUP(L9,Entries!$A:$D,4,0),\"-\")","v":"Willow"},{"$f":"IFERROR(VLOOKUP(L9,Entries!$A:$H,8,0),\"-\")","v":7},{"$f":"IFERROR(VLOOKUP(L9,Entries!$A:$F,6,0),\"-\")","v":"Brentwood Beagles Athletics Club"},"1.29.49"]
[6,258,{"$f":"IFERROR(VLOOKUP(B10,Entries!$A:$E,5,0),\"-\")","v":"Cain"},{"$f":"IFERROR(VLOOKUP(B10,Entries!$A:$D,4,0),\"-\")","v":"George"},{"$f":"IFERROR(VLOOKUP(B10,Entries!$A:$H,8,0),\"-\")","v":8},{"$f":"IFERROR(VLOOKUP(B10,Entries!$A:$F,6,0),\"-\")","v":"City of Southend On Sea AC"},"1.24.6",null,null,null,6,241,{"$f":"IFERROR(VLOOKUP(L10,Entries!$A:$E,5,0),\"-\")","v":"Fenn"},{"$f":"IFERROR(VLOOKUP(L10,Entries!$A:$D,4,0),\"-\")","v":"Ella"},{"$f":"IFERROR(VLOOKUP(L10,Entries!$A:$H,8,0),\"-\")","v":7},{"$f":"IFERROR(VLOOKUP(L10,Entries!$A:$F,6,0),\"-\")","v":"SS Athletics"},"1.34.02",null," "]
[7,242,{"$f":"IFERROR(VLOOKUP(B11,Entries!$A:$E,5,0),\"-\")","v":"Khan"},{"$f":"IFERROR(VLOOKUP(B11,Entries!$A:$D,4,0),\"-\")","v":"Muhammad "},{"$f":"IFERROR(VLOOKUP(B11,Entries!$A:$H,8,0),\"-\")","v":8},{"$f":"IFERROR(VLOOKUP(B11,Entries!$A:$F,6,0),\"-\")","v":"City of Southend On Sea AC"},"1.27.4",null,null,null,7,50,{"$f":"IFERROR(VLOOKUP(L11,Entries!$A:$E,5,0),\"-\")","v":"Nti-Jackson"},{"$f":"IFERROR(VLOOKUP(L11,Entries!$A:$D,4,0),\"-\")","v":"Serena"},{"$f":"IFERROR(VLOOKUP(L11,Entries!$A:$H,8,0),\"-\")","v":7},{"$f":"IFERROR(VLOOKUP(L11,Entries!$A:$F,6,0),\"-\")","v":"SS Athletics"},"1.38.64"]
[8,214,{"$f":"IFERROR(VLOOKUP(B12,Entries!$A:$E,5,0),\"-\")","v":"Connor"},{"$f":"IFERROR(VLOOKUP(B12,Entries!$A:$D,4,0),\"-\")","v":"Sean"},{"$f":"IFERROR(VLOOKUP(B12,Entries!$A:$H,8,0),\"-\")","v":7},{"$f":"IFERROR(VLOOKUP(B12,Entries!$A:$F,6,0),\"-\")","v":"Brentwood Beagles Athletics Club"},"1.29.6",null,null,null,8,221,{"$f":"IFERROR(VLOOKUP(L12,Entries!$A:$E,5,0),\"-\")","v":"Grimes"},{"$f":"IFERROR(VLOOKUP(L12,Entries!$A:$D,4,0),\"-\")","v":"Penelope"},{"$f":"IFERROR(VLOOKUP(L12,Entries!$A:$H,8,0),\"-\")","v":7},{"$f":"IFERROR(VLOOKUP(L12,Entries!$A:$F,6,0),\"-\")","v":"SS Athletics"},"1.46.11"]
[null,null,null,null,null,null,null,null,null,null,9,334,{"$f":"IFERROR(VLOOKUP(L13,Entries!$A:$E,5,0),\"-\")","v":"Frisby-Bright"},{"$f":"IFERROR(VLOOKUP(L13,Entries!$A:$D,4,0),\"-\")","v":"Amalie"},{"$f":"IFERROR(VLOOKUP(L13,Entries!$A:$H,8,0),\"-\")","v":8},{"$f":"IFERROR(VLOOKUP(L13,Entries!$A:$F,6,0),\"-\")","v":"Haverhill Running Club"},"1.48.52"]
[null,null,null,null,null,null,null,null,null,null,10,102,{"$f":"IFERROR(VLOOKUP(L14,Entries!$A:$E,5,0),\"-\")","v":"Hallahan"},{"$f":"IFERROR(VLOOKUP(L14,Entries!$A:$D,4,0),\"-\")","v":"Nainsi"},{"$f":"IFERROR(VLOOKUP(L14,Entries!$A:$H,8,0),\"-\")","v":7},{"$f":"IFERROR(VLOOKUP(L14,Entries!$A:$F,6,0),\"-\")","v":"Unattached"},"1.57.96"]
[]
[]
[]
[]
[]
[]
[]
["U17M"]
["Pos","Number","Last Name","First Name","Age","Club","Time"]
[1,288,{"$f":"IFERROR(VLOOKUP(B24,Entries!$A:$E,5,0),\"-\")","v":"Holland"},{"$f":"IFERROR(VLOOKUP(B24,Entries!$A:$D,4,0),\"-\")","v":"Aydan"},{"$f":"IFERROR(VLOOKUP(B24,Entries!$A:$H,8,0),\"-\")","v":15},{"$f":"IFERROR(VLOOKUP(B24,Entries!$A:$F,6,0),\"-\")","v":"Basildon AC"},"50.47"]
[2,344,{"$f":"IFERROR(VLOOKUP(B25,Entries!$A:$E,5,0),\"-\")","v":"Lee"},{"$f":"IFERROR(VLOOKUP(B25,Entries!$A:$D,4,0),\"-\")","v":"Harry"},{"$f":"IFERROR(VLOOKUP(B25,Entries!$A:$H,8,0),\"-\")","v":15},{"$f":"IFERROR(VLOOKUP(B25,Entries!$A:$F,6,0),\"-\")","v":"Chelmsford AC"},"57.38"]
[3,null,{"$f":"IFERROR(VLOOKUP(B26,Entries!$A:$E,5,0),\"-\")","v":"-"},{"$f":"IFERROR(VLOOKUP(B26,Entries!$A:$D,4,0),\"-\")","v":"-"},{"$f":"IFERROR(VLOOKUP(B26,Entries!$A:$H,8,0),\"-\")","v":"-"},{"$f":"IFERROR(VLOOKUP(B26,Entries!$A:$F,6,0),\"-\")","v":"-"}]
[4,null,{"$f":"IFERROR(VLOOKUP(B27,Entries!$A:$E,5,0),\"-\")","v":"-"},{"$f":"IFERROR(VLOOKUP(B27,Entries!$A:$D,4,0),\"-\")","v":"-"},{"$f":"IFERROR(VLOOKUP(B27,Entries!$A:$H,8,0),\"-\")","v":"-"},{"$f":"IFERROR(VLOOKUP(B27,Entries!$A:$F,6,0),\"-\")","v":"-"}]
[5,null,{"$f":"IFERROR(VLOOKUP(B28,Entries!$A:$E,5,0),\"-\")","v":"-"},{"$f":"IFERROR(VLOOKUP(B28,Entries!$A:$D,4,0),\"-\")","v":"-"},{"$f":"IFERROR(VLOOKUP(B28,Entries!$A:$H,8,0),\"-\")","v":"-"},{"$f":"IFERROR(VLOOKUP(B28,Entries!$A:$F,6,0),\"-\")","v":"-"}]
[6,null,{"$f":"IFERROR(VLOOKUP(B29,Entries!$A:$E,5,0),\"-\")","v":"-"},{"$f":"IFERROR(VLOOKUP(B29,Entries!$A:$D,4,0),\"-\")","v":"-"},{"$f":"IFERROR(VLOOKUP(B29,Entries!$A:$H,8,0),\"-\")","v":"-"},{"$f":"IFERROR(VLOOKUP(B29,Entries!$A:$F,6,0),\"-\")","v":"-"}]
[7,null,{"$f":"IFERROR(VLOOKUP(B30,Entries!$A:$E,5,0),\"-\")","v":"-"},{"$f":"IFERROR(VLOOKUP(B30,Entries!$A:$D,4,0),\"-\")","v":"-"},{"$f":"IFERROR(VLOOKUP(B30,Entries!$A:$H,8,0),\"-\")","v":"-"},{"$f":"IFERROR(VLOOKUP(B30,Entries!$A:$F,6,0),\"-\")","v":"-"}]
[8,null,{"$f":"IFERROR(VLOOKUP(B31,Entries!$A:$E,5,0),\"-\")","v":"-"},{"$f":"IFERROR(VLOOKUP(B31,Entries!$A:$D,4,0),\"-\")","v":"-"},{"$f":"IFERROR(VLOOKUP(B31,Entries!$A:$H,8,0),\"-\")","v":"-"},{"$f":"IFERROR(VLOOKUP(B31,Entries!$A:$F,6,0),\"-\")","v":"-"}]
[]
["U20 Men",null,null,null,null,null,null,null,null,null,"U20 Women"]
["Pos","Number","Last Name","First Name","Age","Club","Time",null,null,null,"Pos","Number","Last Name","First Name","Age","Club","Time"]
[1,225,{"$f":"IFERROR(VLOOKUP(B35,Entries!$A:$E,5,0),\"-\")","v":"Robinson"},{"$f":"IFERROR(VLOOKUP(B35,Entries!$A:$D,4,0),\"-\")","v":"Joshua"},{"$f":"IFERROR(VLOOKUP(B35,Entries!$A:$H,8,0),\"-\")","v":18},{"$f":"IFERROR(VLOOKUP(B35,Entries!$A:$F,6,0),\"-\")","v":"City of Southend On Sea AC"},"51.78",null,null,null,1,289,{"$f":"IFERROR(VLOOKUP(L35,Entries!$A:$E,5,0),\"-\")","v":"Jones"},{"$f":"IFERROR(VLOOKUP(L35,Entries!$A:$D,4,0),\"-\")","v":"Imogen"},{"$f":"IFERROR(VLOOKUP(L35,Entries!$A:$H,8,0),\"-\")","v":17},{"$f":"IFERROR(VLOOKUP(L35,Entries!$A:$F,6,0),\"-\")","v":"Basildon AC"},"1.17.67"]
[2,null,{"$f":"IFERROR(VLOOKUP(B36,Entries!$A:$E,5,0),\"-\")","v":"-"},{"$f":"IFERROR(VLOOKUP(B36,Entries!$A:$D,4,0),\"-\")","v":"-"},{"$f":"IFERROR(VLOOKUP(B36,Entries!$A:$H,8,0),\"-\")","v":"-"},{"$f":"IFERROR(VLOOKUP(B36,Entries!$A:$F,6,0),\"-\")","v":"-"},null,null,null,null,2,null,{"$f":"IFERROR(VLOOKUP(L36,Entries!$A:$E,5,0),\"-\")","v":"-"},{"$f":"IFERROR(VLOOKUP(L36,Entries!$A:$D,4,0),\"-\")","v":"-"},{"$f":"IFERROR(VLOOKUP(L36,Entries!$A:$H,8,0),\"-\")","v":"-"},{"$f":"IFERROR(VLOOKUP(L36,Entries!$A:$F,6,0),\"-\")","v":"-"}]
[3,null,{"$f":"IFERROR(VLOOKUP(B37,Entries!$A:$E,5,0),\"-\")","v":"-"},{"$f":"IFERROR(VLOOKUP(B37,Entries!$A:$D,4,0),\"-\")","v":"-"},{"$f":"IFERROR(VLOOKUP(B37,Entries!$A:$H,8,0),\"-\")","v":"-"},{"$f":"IFERROR(VLOOKUP(B37,Entries!$A:$F,6,0),\"-\")","v":"-"},null,null,null,null,3,null,{"$f":"IFERROR(VLOOKUP(L37,Entries!$A:$E,5,0),\"-\")","v":"-"},{"$f":"IFERROR(VLOOKUP(L37,Entries!$A:$D,4,0),\"-\")","v":"-"},{"$f":"IFERROR(VLOOKUP(L37,Entries!$A:$H,8,0),\"-\")","v":"-"},{"$f":"IFERROR(VLOOKUP(L37,Entries!$A:$F,6,0),\"-\")","v":"-"}]
[4,null,{"$f":"IFERROR(VLOOKUP(B38,Entries!$A:$E,5,0),\"-\")","v":"-"},{"$f":"IFERROR(VLOOKUP(B38,Entries!$A:$D,4,0),\"-\")","v":"-"},{"$f":"IFERROR(VLOOKUP(B38,Entries!$A:$H,8,0),\"-\")","v":"-"},{"$f":"IFERROR(VLOOKUP(B38,Entries!$A:$F,6,0),\"-\")","v":"-"},null,null,null,null,4,null,{"$f":"IFERROR(VLOOKUP(L38,Entries!$A:$E,5,0),\"-\")","v":"-"},{"$f":"IFERROR(VLOOKUP(L38,Entries!$A:$D,4,0),\"-\")","v":"-"},{"$f":"IFERROR(VLOOKUP(L38,Entries!$A:$H,8,0),\"-\")","v":"-"},{"$f":"IFERROR(VLOOKUP(L38,Entries!$A:$F,6,0),\"-\")","v":"-"}]
[5,null,{"$f":"IFERROR(VLOOKUP(B39,Entries!$A:$E,5,0),\"-\")","v":"-"},{"$f":"IFERROR(VLOOKUP(B39,Entries!$A:$D,4,0),\"-\")","v":"-"},{"$f":"IFERROR(VLOOKUP(B39,Entries!$A:$H,8,0),\"-\")","v":"-"},{"$f":"IFERROR(VLOOKUP(B39,Entries!$A:$F,6,0),\"-\")","v":"-"},null,null,null,null,5,null,{"$f":"IFERROR(VLOOKUP(L39,Entries!$A:$E,5,0),\"-\")","v":"-"},{"$f":"IFERROR(VLOOKUP(L39,Entries!$A:$D,4,0),\"-\")","v":"-"},{"$f":"IFERROR(VLOOKUP(L39,Entries!$A:$H,8,0),\"-\")","v":"-"},{"$f":"IFERROR(VLOOKUP(L39,Entries!$A:$F,6,0),\"-\")","v":"-"}]
[6,null,{"$f":"IFERROR(VLOOKUP(B40,Entries!$A:$E,5,0),\"-\")","v":"-"},{"$f":"IFERROR(VLOOKUP(B40,Entries!$A:$D,4,0),\"-\")","v":"-"},{"$f":"IFERROR(VLOOKUP(B40,Entries!$A:$H,8,0),\"-\")","v":"-"},{"$f":"IFERROR(VLOOKUP(B40,Entries!$A:$F,6,0),\"-\")","v":"-"},null,null,null,null,6,null,{"$f":"IFERROR(VLOOKUP(L40,Entries!$A:$E,5,0),\"-\")","v":"-"},{"$f":"IFERROR(VLOOKUP(L40,Entries!$A:$D,4,0),\"-\")","v":"-"},{"$f":"IFERROR(VLOOKUP(L40,Entries!$A:$H,8,0),\"-\")","v":"-"},{"$f":"IFERROR(VLOOKUP(L40,Entries!$A:$F,6,0),\"-\")","v":"-"}]
[7,null,{"$f":"IFERROR(VLOOKUP(B41,Entries!$A:$E,5,0),\"-\")","v":"-"},{"$f":"IFERROR(VLOOKUP(B41,Entries!$A:$D,4,0),\"-\")","v":"-"},{"$f":"IFERROR(VLOOKUP(B41,Entries!$A:$H,8,0),\"-\")","v":"-"},{"$f":"IFERROR(VLOOKUP(B41,Entries!$A:$F,6,0),\"-\")","v":"-"},null,null,null,null,7,null,{"$f":"IFERROR(VLOOKUP(L41,Entries!$A:$E,5,0),\"-\")","v":"-"},{"$f":"IFERROR(VLOOKUP(L41,Entries!$A:$D,4,0),\"-\")","v":"-"},{"$f":"IFERROR(VLOOKUP(L41,Entries!$A:$H,8,0),\"-\")","v":"-"},{"$f":"IFERROR(VLOOKUP(L41,Entries!$A:$F,6,0),\"-\")","v":"-"}]
[8,null,{"$f":"IFERROR(VLOOKUP(B42,Entries!$A:$E,5,0),\"-\")","v":"-"},{"$f":"IFERROR(VLOOKUP(B42,Entries!$A:$D,4,0),\"-\")","v":"-"},{"$f":"IFERROR(VLOOKUP(B42,Entries!$A:$H,8,0),\"-\")","v":"-"},{"$f":"IFERROR(VLOOKUP(B42,Entries!$A:$F,6,0),\"-\")","v":"-"},null,null,null,null,8,null,{"$f":"IFERROR(VLOOKUP(L42,Entries!$A:$E,5,0),\"-\")","v":"-"},{"$f":"IFERROR(VLOOKUP(L42,Entries!$A:$D,4,0),\"-\")","v":"-"},{"$f":"IFERROR(VLOOKUP(L42,Entries!$A:$H,8,0),\"-\")","v":"-"},{"$f":"IFERROR(VLOOKUP(L42,Entries!$A:$F,6,0),\"-\")","v":"-"}]
[]
["Senior Men",null,null,null,null,null,null,null,null,null,"Senior Women"]
["Pos","Number","Last Name","First Name","Age","Club","Time",null,null,null,"Pos","Number","Last Name","First Name","Age","Club","Time"]
[1,342,{"$f":"IFERROR(VLOOKUP(B46,Entries!$A:$E,5,0),\"-\")","v":"Berrett"},{"$f":"IFERROR(VLOOKUP(B46,Entries!$A:$D,4,0),\"-\")","v":"Louis"},{"$f":"IFERROR(VLOOKUP(B46,Entries!$A:$H,8,0),\"-\")","v":22},{"$f":"IFERROR(VLOOKUP(B46,Entries!$A:$F,6,0),\"-\")","v":"Havering AC"},"52.30",null,null,null,1,296,{"$f":"IFERROR(VLOOKUP(L46,Entries!$A:$E,5,0),\"-\")","v":"Matthews Smith"},{"$f":"IFERROR(VLOOKUP(L46,Entries!$A:$D,4,0),\"-\")","v":"Annabel Nicola"},{"$f":"IFERROR(VLOOKUP(L46,Entries!$A:$H,8,0),\"-\")","v":28},{"$f":"IFERROR(VLOOKUP(L46,Entries!$A:$F,6,0),\"-\")","v":"City of Southend On Sea AC"},"1.11.14"]
[2,null,{"$f":"IFERROR(VLOOKUP(B47,Entries!$A:$E,5,0),\"-\")","v":"-"},{"$f":"IFERROR(VLOOKUP(B47,Entries!$A:$D,4,0),\"-\")","v":"-"},{"$f":"IFERROR(VLOOKUP(B47,Entries!$A:$H,8,0),\"-\")","v":"-"},{"$f":"IFERROR(VLOOKUP(B47,Entries!$A:$F,6,0),\"-\")","v":"-"},null,null,null,null,2,231,{"$f":"IFERROR(VLOOKUP(L47,Entries!$A:$E,5,0),\"-\")","v":"Hopper"},{"$f":"IFERROR(VLOOKUP(L47,Entries!$A:$D,4,0),\"-\")","v":"Laura"},{"$f":"IFERROR(VLOOKUP(L47,Entries!$A:$H,8,0),\"-\")","v":23},{"$f":"IFERROR(VLOOKUP(L47,Entries!$A:$F,6,0),\"-\")","v":"London City Runners"},"1.17.76"]
[3,null,{"$f":"IFERROR(VLOOKUP(B48,Entries!$A:$E,5,0),\"-\")","v":"-"},{"$f":"IFERROR(VLOOKUP(B48,Entries!$A:$D,4,0),\"-\")","v":"-"},{"$f":"IFERROR(VLOOKUP(B48,Entries!$A:$H,8,0),\"-\")","v":"-"},{"$f":"IFERROR(VLOOKUP(B48,Entries!$A:$F,6,0),\"-\")","v":"-"},null,null,null,null,3,null,{"$f":"IFERROR(VLOOKUP(L48,Entries!$A:$E,5,0),\"-\")","v":"-"},{"$f":"IFERROR(VLOOKUP(L48,Entries!$A:$D,4,0),\"-\")","v":"-"},{"$f":"IFERROR(VLOOKUP(L48,Entries!$A:$H,8,0),\"-\")","v":"-"},{"$f":"IFERROR(VLOOKUP(L48,Entries!$A:$F,6,0),\"-\")","v":"-"}]
[4,null,{"$f":"IFERROR(VLOOKUP(B49,Entries!$A:$E,5,0),\"-\")","v":"-"},{"$f":"IFERROR(VLOOKUP(B49,Entries!$A:$D,4,0),\"-\")","v":"-"},{"$f":"IFERROR(VLOOKUP(B49,Entries!$A:$H,8,0),\"-\")","v":"-"},{"$f":"IFERROR(VLOOKUP(B49,Entries!$A:$F,6,0),\"-\")","v":"-"},null,null,null,null,4,null,{"$f":"IFERROR(VLOOKUP(L49,Entries!$A:$E,5,0),\"-\")","v":"-"},{"$f":"IFERROR(VLOOKUP(L49,Entries!$A:$D,4,0),\"-\")","v":"-"},{"$f":"IFERROR(VLOOKUP(L49,Entries!$A:$H,8,0),\"-\")","v":"-"},{"$f":"IFERROR(VLOOKUP(L49,Entries!$A:$F,6,0),\"-\")","v":"-"}]
[5,null,{"$f":"IFERROR(VLOOKUP(B50,Entries!$A:$E,5,0),\"-\")","v":"-"},{"$f":"IFERROR(VLOOKUP(B50,Entries!$A:$D,4,0),\"-\")","v":"-"},{"$f":"IFERROR(VLOOKUP(B50,Entries!$A:$H,8,0),\"-\")","v":"-"},{"$f":"IFERROR(VLOOKUP(B50,Entries!$A:$F,6,0),\"-\")","v":"-"},null,null,null,null,5,null,{"$f":"IFERROR(VLOOKUP(L50,Entries!$A:$E,5,0),\"-\")","v":"-"},{"$f":"IFERROR(VLOOKUP(L50,Entries!$A:$D,4,0),\"-\")","v":"-"},{"$f":"IFERROR(VLOOKUP(L50,Entries!$A:$H,8,0),\"-\")","v":"-"},{"$f":"IFERROR(VLOOKUP(L50,Entries!$A:$F,6,0),\"-\")","v":"-"}]
[6,null,{"$f":"IFERROR(VLOOKUP(B51,Entries!$A:$E,5,0),\"-\")","v":"-"},{"$f":"IFERROR(VLOOKUP(B51,Entries!$A:$D,4,0),\"-\")","v":"-"},{"$f":"IFERROR(VLOOKUP(B51,Entries!$A:$H,8,0),\"-\")","v":"-"},{"$f":"IFERROR(VLOOKUP(B51,Entries!$A:$F,6,0),\"-\")","v":"-"},null,null,null,null,6,null,{"$f":"IFERROR(VLOOKUP(L51,Entries!$A:$E,5,0),\"-\")","v":"-"},{"$f":"IFERROR(VLOOKUP(L51,Entries!$A:$D,4,0),\"-\")","v":"-"},{"$f":"IFERROR(VLOOKUP(L51,Entries!$A:$H,8,0),\"-\")","v":"-"},{"$f":"IFERROR(VLOOKUP(L51,Entries!$A:$F,6,0),\"-\")","v":"-"}]
[7,null,{"$f":"IFERROR(VLOOKUP(B52,Entries!$A:$E,5,0),\"-\")","v":"-"},{"$f":"IFERROR(VLOOKUP(B52,Entries!$A:$D,4,0),\"-\")","v":"-"},{"$f":"IFERROR(VLOOKUP(B52,Entries!$A:$H,8,0),\"-\")","v":"-"},{"$f":"IFERROR(VLOOKUP(B52,Entries!$A:$F,6,0),\"-\")","v":"-"},null,null,null,null,7,null,{"$f":"IFERROR(VLOOKUP(L52,Entries!$A:$E,5,0),\"-\")","v":"-"},{"$f":"IFERROR(VLOOKUP(L52,Entries!$A:$D,4,0),\"-\")","v":"-"},{"$f":"IFERROR(VLOOKUP(L52,Entries!$A:$H,8,0),\"-\")","v":"-"},{"$f":"IFERROR(VLOOKUP(L52,Entries!$A:$F,6,0),\"-\")","v":"-"}]
[8,null,{"$f":"IFERROR(VLOOKUP(B53,Entries!$A:$E,5,0),\"-\")","v":"-"},{"$f":"IFERROR(VLOOKUP(B53,Entries!$A:$D,4,0),\"-\")","v":"-"},{"$f":"IFERROR(VLOOKUP(B53,Entries!$A:$H,8,0),\"-\")","v":"-"},{"$f":"IFERROR(VLOOKUP(B53,Entries!$A:$F,6,0),\"-\")","v":"-"},null,null,null,null,8,null,{"$f":"IFERROR(VLOOKUP(L53,Entries!$A:$E,5,0),\"-\")","v":"-"},{"$f":"IFERROR(VLOOKUP(L53,Entries!$A:$D,4,0),\"-\")","v":"-"},{"$f":"IFERROR(VLOOKUP(L53,Entries!$A:$H,8,0),\"-\")","v":"-"},{"$f":"IFERROR(VLOOKUP(L53,Entries!$A:$F,6,0),\"-\")","v":"-"}]
[]
["Veteran Men",null,null,null,null,null,null,null,null,null,"Veteran Women"]
["Pos","Number","Last Name","First Name","Age","Club","Time",null,null,null,"Pos","Number","Last Name","First Name","Age","Club","Time"]
[1,346,{"$f":"IFERROR(VLOOKUP(B57,Entries!$A:$E,5,0),\"-\")","v":"Brewer"},{"$f":"IFERROR(VLOOKUP(B57,Entries!$A:$D,4,0),\"-\")","v":"Scott"},{"$f":"IFERROR(VLOOKUP(B57,Entries!$A:$H,8,0),\"-\")","v":38},{"$f":"IFERROR(VLOOKUP(B57,Entries!$A:$F,6,0),\"-\")","v":"Thames Valley Harriers"},"59.65",null,null,null,1,345,{"$f":"IFERROR(VLOOKUP(L57,Entries!$A:$E,5,0),\"-\")","v":"Donnelly"},{"$f":"IFERROR(VLOOKUP(L57,Entries!$A:$D,4,0),\"-\")","v":"Linda"},{"$f":"IFERROR(VLOOKUP(L57,Entries!$A:$H,8,0),\"-\")","v":66},{"$f":"IFERROR(VLOOKUP(L57,Entries!$A:$F,6,0),\"-\")","v":"City of Southend On Sea AC"},"1.40.83"]
[2,343,{"$f":"IFERROR(VLOOKUP(B58,Entries!$A:$E,5,0),\"-\")","v":"Berrett"},{"$f":"IFERROR(VLOOKUP(B58,Entries!$A:$D,4,0),\"-\")","v":"Paul"},{"$f":"IFERROR(VLOOKUP(B58,Entries!$A:$H,8,0),\"-\")","v":62},{"$f":"IFERROR(VLOOKUP(B58,Entries!$A:$F,6,0),\"-\")","v":"Havering AC"},"1.07.84",null,null,null,2,null,{"$f":"IFERROR(VLOOKUP(L58,Entries!$A:$E,5,0),\"-\")","v":"-"},{"$f":"IFERROR(VLOOKUP(L58,Entries!$A:$D,4,0),\"-\")","v":"-"},{"$f":"IFERROR(VLOOKUP(L58,Entries!$A:$H,8,0),\"-\")","v":"-"},{"$f":"IFERROR(VLOOKUP(L58,Entries!$A:$F,6,0),\"-\")","v":"-"}]
[3,209,{"$f":"IFERROR(VLOOKUP(B59,Entries!$A:$E,5,0),\"-\")","v":"William"},{"$f":"IFERROR(VLOOKUP(B59,Entries!$A:$D,4,0),\"-\")","v":"Bernard"},{"$f":"IFERROR(VLOOKUP(B59,Entries!$A:$H,8,0),\"-\")","v":35},{"$f":"IFERROR(VLOOKUP(B59,Entries!$A:$F,6,0),\"-\")","v":"JBR Run and Tri Club"},"1.11.34",null,null,null,3,null,{"$f":"IFERROR(VLOOKUP(L59,Entries!$A:$E,5,0),\"-\")","v":"-"},{"$f":"IFERROR(VLOOKUP(L59,Entries!$A:$D,4,0),\"-\")","v":"-"},{"$f":"IFERROR(VLOOKUP(L59,Entries!$A:$H,8,0),\"-\")","v":"-"},{"$f":"IFERROR(VLOOKUP(L59,Entries!$A:$F,6,0),\"-\")","v":"-"}]
[4,null,{"$f":"IFERROR(VLOOKUP(B60,Entries!$A:$E,5,0),\"-\")","v":"-"},{"$f":"IFERROR(VLOOKUP(B60,Entries!$A:$D,4,0),\"-\")","v":"-"},{"$f":"IFERROR(VLOOKUP(B60,Entries!$A:$H,8,0),\"-\")","v":"-"},{"$f":"IFERROR(VLOOKUP(B60,Entries!$A:$F,6,0),\"-\")","v":"-"},null,null,null,null,4,null,{"$f":"IFERROR(VLOOKUP(L60,Entries!$A:$E,5,0),\"-\")","v":"-"},{"$f":"IFERROR(VLOOKUP(L60,Entries!$A:$D,4,0),\"-\")","v":"-"},{"$f":"IFERROR(VLOOKUP(L60,Entries!$A:$H,8,0),\"-\")","v":"-"},{"$f":"IFERROR(VLOOKUP(L60,Entries!$A:$F,6,0),\"-\")","v":"-"}]
[5,null,{"$f":"IFERROR(VLOOKUP(B61,Entries!$A:$E,5,0),\"-\")","v":"-"},{"$f":"IFERROR(VLOOKUP(B61,Entries!$A:$D,4,0),\"-\")","v":"-"},{"$f":"IFERROR(VLOOKUP(B61,Entries!$A:$H,8,0),\"-\")","v":"-"},{"$f":"IFERROR(VLOOKUP(B61,Entries!$A:$F,6,0),\"-\")","v":"-"},null,null,null,null,5,null,{"$f":"IFERROR(VLOOKUP(L61,Entries!$A:$E,5,0),\"-\")","v":"-"},{"$f":"IFERROR(VLOOKUP(L61,Entries!$A:$D,4,0),\"-\")","v":"-"},{"$f":"IFERROR(VLOOKUP(L61,Entries!$A:$H,8,0),\"-\")","v":"-"},{"$f":"IFERROR(VLOOKUP(L61,Entries!$A:$F,6,0),\"-\")","v":"-"}]
[6,null,{"$f":"IFERROR(VLOOKUP(B62,Entries!$A:$E,5,0),\"-\")","v":"-"},{"$f":"IFERROR(VLOOKUP(B62,Entries!$A:$D,4,0),\"-\")","v":"-"},{"$f":"IFERROR(VLOOKUP(B62,Entries!$A:$H,8,0),\"-\")","v":"-"},{"$f":"IFERROR(VLOOKUP(B62,Entries!$A:$F,6,0),\"-\")","v":"-"},null,null,null,null,6,null,{"$f":"IFERROR(VLOOKUP(L62,Entries!$A:$E,5,0),\"-\")","v":"-"},{"$f":"IFERROR(VLOOKUP(L62,Entries!$A:$D,4,0),\"-\")","v":"-"},{"$f":"IFERROR(VLOOKUP(L62,Entries!$A:$H,8,0),\"-\")","v":"-"},{"$f":"IFERROR(VLOOKUP(L62,Entries!$A:$F,6,0),\"-\")","v":"-"}]
[7,null,{"$f":"IFERROR(VLOOKUP(B63,Entries!$A:$E,5,0),\"-\")","v":"-"},{"$f":"IFERROR(VLOOKUP(B63,Entries!$A:$D,4,0),\"-\")","v":"-"},{"$f":"IFERROR(VLOOKUP(B63,Entries!$A:$H,8,0),\"-\")","v":"-"},{"$f":"IFERROR(VLOOKUP(B63,Entries!$A:$F,6,0),\"-\")","v":"-"},null,null,null,null,7,null,{"$f":"IFERROR(VLOOKUP(L63,Entries!$A:$E,5,0),\"-\")","v":"-"},{"$f":"IFERROR(VLOOKUP(L63,Entries!$A:$D,4,0),\"-\")","v":"-"},{"$f":"IFERROR(VLOOKUP(L63,Entries!$A:$H,8,0),\"-\")","v":"-"},{"$f":"IFERROR(VLOOKUP(L63,Entries!$A:$F,6,0),\"-\")","v":"-"}]
[8,null,{"$f":"IFERROR(VLOOKUP(B64,Entries!$A:$E,5,0),\"-\")","v":"-"},{"$f":"IFERROR(VLOOKUP(B64,Entries!$A:$D,4,0),\"-\")","v":"-"},{"$f":"IFERROR(VLOOKUP(B64,Entries!$A:$H,8,0),\"-\")","v":"-"},{"$f":"IFERROR(VLOOKUP(B64,Entries!$A:$F,6,0),\"-\")","v":"-"},null,null,null,null,8,null,{"$f":"IFERROR(VLOOKUP(L64,Entries!$A:$E,5,0),\"-\")","v":"-"},{"$f":"IFERROR(VLOOKUP(L64,Entries!$A:$D,4,0),\"-\")","v":"-"},{"$f":"IFERROR(VLOOKUP(L64,Entries!$A:$H,8,0),\"-\")","v":"-"},{"$f":"IFERROR(VLOOKUP(L64,Entries!$A:$F,6,0),\"-\")","v":"-"}]

{"sheet":"600m","index":11,"n_rows":31,"n_cols":15,"rows_kept":31,"cut":false,"hidden":false,"merged":[]}
["600m","U11 Year 3,4 & 5"]
[]
["U11 Boys Heat 1",null,null,null,null,null,null,null,"U11 Girls Heat 1"]
["Pos","Number","Last Name","First Name","Age","Club","Time",null,"Pos","Number","Last Name","First Name","Age","Club","Time"]
[1,55,{"$f":"IFERROR(VLOOKUP(B5,Entries!$A:$E,5,0),\"-\")","v":"Thompson"},{"$f":"IFERROR(VLOOKUP(B5,Entries!$A:$D,4,0),\"-\")","v":"Rocco"},{"$f":"IFERROR(VLOOKUP(B5,Entries!$A:$H,8,0),\"-\")","v":9},{"$f":"IFERROR(VLOOKUP(B5,Entries!$A:$F,6,0),\"-\")","v":"SS Athletics"},"1.57.81",null,1,42,{"$f":"IFERROR(VLOOKUP(J5,Entries!$A:$E,5,0),\"-\")","v":"Burrows"},{"$f":"IFERROR(VLOOKUP(J5,Entries!$A:$D,4,0),\"-\")","v":"Honor"},{"$f":"IFERROR(VLOOKUP(J5,Entries!$A:$H,8,0),\"-\")","v":9},{"$f":"IFERROR(VLOOKUP(J5,Entries!$A:$F,6,0),\"-\")","v":"SS Athletics"},"2.03.90"]
[2,338,{"$f":"IFERROR(VLOOKUP(B6,Entries!$A:$E,5,0),\"-\")","v":"Geller"},{"$f":"IFERROR(VLOOKUP(B6,Entries!$A:$D,4,0),\"-\")","v":"Jesse"},{"$f":"IFERROR(VLOOKUP(B6,Entries!$A:$H,8,0),\"-\")","v":9},{"$f":"IFERROR(VLOOKUP(B6,Entries!$A:$F,6,0),\"-\")","v":"Woodford Green AC with Essex Ladies"},"2.02.81",null,2,103,{"$f":"IFERROR(VLOOKUP(J6,Entries!$A:$E,5,0),\"-\")","v":"Townsend"},{"$f":"IFERROR(VLOOKUP(J6,Entries!$A:$D,4,0),\"-\")","v":"Ronni"},{"$f":"IFERROR(VLOOKUP(J6,Entries!$A:$H,8,0),\"-\")","v":9},{"$f":"IFERROR(VLOOKUP(J6,Entries!$A:$F,6,0),\"-\")","v":"Colchester & Tendring AC"},"2.06.26"]
[3,162,{"$f":"IFERROR(VLOOKUP(B7,Entries!$A:$E,5,0),\"-\")","v":"Birnie"},{"$f":"IFERROR(VLOOKUP(B7,Entries!$A:$D,4,0),\"-\")","v":"Jack"},{"$f":"IFERROR(VLOOKUP(B7,Entries!$A:$H,8,0),\"-\")","v":9},{"$f":"IFERROR(VLOOKUP(B7,Entries!$A:$F,6,0),\"-\")","v":"Benfleet RC"},"2.03.70",null,3,335,{"$f":"IFERROR(VLOOKUP(J7,Entries!$A:$E,5,0),\"-\")","v":"Smith"},{"$f":"IFERROR(VLOOKUP(J7,Entries!$A:$D,4,0),\"-\")","v":"Blossom"},{"$f":"IFERROR(VLOOKUP(J7,Entries!$A:$H,8,0),\"-\")","v":9},{"$f":"IFERROR(VLOOKUP(J7,Entries!$A:$F,6,0),\"-\")","v":"Brentwood Beagles Athletics Club"},"2.08.28"]
[4,84,{"$f":"IFERROR(VLOOKUP(B8,Entries!$A:$E,5,0),\"-\")","v":"Brazier"},{"$f":"IFERROR(VLOOKUP(B8,Entries!$A:$D,4,0),\"-\")","v":"James"},{"$f":"IFERROR(VLOOKUP(B8,Entries!$A:$H,8,0),\"-\")","v":9},{"$f":"IFERROR(VLOOKUP(B8,Entries!$A:$F,6,0),\"-\")","v":"SS Athletics"},"2.04.78",null,4,328,{"$f":"IFERROR(VLOOKUP(J8,Entries!$A:$E,5,0),\"-\")","v":"Hallahan"},{"$f":"IFERROR(VLOOKUP(J8,Entries!$A:$D,4,0),\"-\")","v":"Orlaith"},{"$f":"IFERROR(VLOOKUP(J8,Entries!$A:$H,8,0),\"-\")","v":9},{"$f":"IFERROR(VLOOKUP(J8,Entries!$A:$F,6,0),\"-\")","v":"Unattached"},"2.11.54"]
[5,298,{"$f":"IFERROR(VLOOKUP(B9,Entries!$A:$E,5,0),\"-\")","v":"Hickey"},{"$f":"IFERROR(VLOOKUP(B9,Entries!$A:$D,4,0),\"-\")","v":"Leo"},{"$f":"IFERROR(VLOOKUP(B9,Entries!$A:$H,8,0),\"-\")","v":9},{"$f":"IFERROR(VLOOKUP(B9,Entries!$A:$F,6,0),\"-\")","v":"City of Southend On Sea AC"},"2.04.92",null,5,134,{"$f":"IFERROR(VLOOKUP(J9,Entries!$A:$E,5,0),\"-\")","v":"Perry"},{"$f":"IFERROR(VLOOKUP(J9,Entries!$A:$D,4,0),\"-\")","v":"Elsie"},{"$f":"IFERROR(VLOOKUP(J9,Entries!$A:$H,8,0),\"-\")","v":9},{"$f":"IFERROR(VLOOKUP(J9,Entries!$A:$F,6,0),\"-\")","v":"SS Athletics"},"2.18.97"]
[6,257,{"$f":"IFERROR(VLOOKUP(B10,Entries!$A:$E,5,0),\"-\")","v":"Radley"},{"$f":"IFERROR(VLOOKUP(B10,Entries!$A:$D,4,0),\"-\")","v":"Lenny"},{"$f":"IFERROR(VLOOKUP(B10,Entries!$A:$H,8,0),\"-\")","v":9},{"$f":"IFERROR(VLOOKUP(B10,Entries!$A:$F,6,0),\"-\")","v":"Unattached"},"2.05.10",null,6,243,{"$f":"IFERROR(VLOOKUP(J10,Entries!$A:$E,5,0),\"-\")","v":"Garwood"},{"$f":"IFERROR(VLOOKUP(J10,Entries!$A:$D,4,0),\"-\")","v":"Ella-Rose"},{"$f":"IFERROR(VLOOKUP(J10,Entries!$A:$H,8,0),\"-\")","v":9},{"$f":"IFERROR(VLOOKUP(J10,Entries!$A:$F,6,0),\"-\")","v":"SS Athletics"},"2.24.85"]
[7,168,{"$f":"IFERROR(VLOOKUP(B11,Entries!$A:$E,5,0),\"-\")","v":"Blomfield"},{"$f":"IFERROR(VLOOKUP(B11,Entries!$A:$D,4,0),\"-\")","v":"Jack"},{"$f":"IFERROR(VLOOKUP(B11,Entries!$A:$H,8,0),\"-\")","v":9},{"$f":"IFERROR(VLOOKUP(B11,Entries!$A:$F,6,0),\"-\")","v":"SS Athletics"},"2.10.70",null,7,254,{"$f":"IFERROR(VLOOKUP(J11,Entries!$A:$E,5,0),\"-\")","v":"Bredin"},{"$f":"IFERROR(VLOOKUP(J11,Entries!$A:$D,4,0),\"-\")","v":"Lily"},{"$f":"IFERROR(VLOOKUP(J11,Entries!$A:$H,8,0),\"-\")","v":9},{"$f":"IFERROR(VLOOKUP(J11,Entries!$A:$F,6,0),\"-\")","v":"Castle Point Joggers"},"2.26.87"]
[8,144,{"$f":"IFERROR(VLOOKUP(B12,Entries!$A:$E,5,0),\"-\")","v":"Massey"},{"$f":"IFERROR(VLOOKUP(B12,Entries!$A:$D,4,0),\"-\")","v":"Angelo"},{"$f":"IFERROR(VLOOKUP(B12,Entries!$A:$H,8,0),\"-\")","v":9},{"$f":"IFERROR(VLOOKUP(B12,Entries!$A:$F,6,0),\"-\")","v":"Unattached"},"2.16.66",null,8,220,{"$f":"IFERROR(VLOOKUP(J12,Entries!$A:$E,5,0),\"-\")","v":"Grimes"},{"$f":"IFERROR(VLOOKUP(J12,Entries!$A:$D,4,0),\"-\")","v":"Poppy"},{"$f":"IFERROR(VLOOKUP(J12,Entries!$A:$H,8,0),\"-\")","v":9},{"$f":"IFERROR(VLOOKUP(J12,Entries!$A:$F,6,0),\"-\")","v":"SS Athletics"},"2.31.83"]
[9,88,{"$f":"IFERROR(VLOOKUP(B13,Entries!$A:$E,5,0),\"-\")","v":"Stammers"},{"$f":"IFERROR(VLOOKUP(B13,Entries!$A:$D,4,0),\"-\")","v":"Rafael"},{"$f":"IFERROR(VLOOKUP(B13,Entries!$A:$H,8,0),\"-\")","v":9},{"$f":"IFERROR(VLOOKUP(B13,Entries!$A:$F,6,0),\"-\")","v":"Unattached"},"2.16.94",null,9,null,{"$f":"IFERROR(VLOOKUP(J13,Entries!$A:$E,5,0),\"-\")","v":"-"},{"$f":"IFERROR(VLOOKUP(J13,Entries!$A:$D,4,0),\"-\")","v":"-"},{"$f":"IFERROR(VLOOKUP(J13,Entries!$A:$H,8,0),\"-\")","v":"-"},{"$f":"IFERROR(VLOOKUP(J13,Entries!$A:$F,6,0),\"-\")","v":"-"}]
[10,null,{"$f":"IFERROR(VLOOKUP(B14,Entries!$A:$E,5,0),\"-\")","v":"-"},{"$f":"IFERROR(VLOOKUP(B14,Entries!$A:$D,4,0),\"-\")","v":"-"},{"$f":"IFERROR(VLOOKUP(B14,Entries!$A:$H,8,0),\"-\")","v":"-"},{"$f":"IFERROR(VLOOKUP(B14,Entries!$A:$F,6,0),\"-\")","v":"-"},null,null,10,null,{"$f":"IFERROR(VLOOKUP(J14,Entries!$A:$E,5,0),\"-\")","v":"-"},{"$f":"IFERROR(VLOOKUP(J14,Entries!$A:$D,4,0),\"-\")","v":"-"},{"$f":"IFERROR(VLOOKUP(J14,Entries!$A:$H,8,0),\"-\")","v":"-"},{"$f":"IFERROR(VLOOKUP(J14,Entries!$A:$F,6,0),\"-\")","v":"-"}]
[11,null,{"$f":"IFERROR(VLOOKUP(B15,Entries!$A:$E,5,0),\"-\")","v":"-"},{"$f":"IFERROR(VLOOKUP(B15,Entries!$A:$D,4,0),\"-\")","v":"-"},{"$f":"IFERROR(VLOOKUP(B15,Entries!$A:$H,8,0),\"-\")","v":"-"},{"$f":"IFERROR(VLOOKUP(B15,Entries!$A:$F,6,0),\"-\")","v":"-"},null,null,11,null,{"$f":"IFERROR(VLOOKUP(J15,Entries!$A:$E,5,0),\"-\")","v":"-"},{"$f":"IFERROR(VLOOKUP(J15,Entries!$A:$D,4,0),\"-\")","v":"-"},{"$f":"IFERROR(VLOOKUP(J15,Entries!$A:$H,8,0),\"-\")","v":"-"},{"$f":"IFERROR(VLOOKUP(J15,Entries!$A:$F,6,0),\"-\")","v":"-"}]
[12,null,{"$f":"IFERROR(VLOOKUP(B16,Entries!$A:$E,5,0),\"-\")","v":"-"},{"$f":"IFERROR(VLOOKUP(B16,Entries!$A:$D,4,0),\"-\")","v":"-"},{"$f":"IFERROR(VLOOKUP(B16,Entries!$A:$H,8,0),\"-\")","v":"-"},{"$f":"IFERROR(VLOOKUP(B16,Entries!$A:$F,6,0),\"-\")","v":"-"},null,null,12,null,{"$f":"IFERROR(VLOOKUP(J16,Entries!$A:$E,5,0),\"-\")","v":"-"},{"$f":"IFERROR(VLOOKUP(J16,Entries!$A:$D,4,0),\"-\")","v":"-"},{"$f":"IFERROR(VLOOKUP(J16,Entries!$A:$H,8,0),\"-\")","v":"-"},{"$f":"IFERROR(VLOOKUP(J16,Entries!$A:$F,6,0),\"-\")","v":"-"}]
[]
[]
["U11 Boys Heat 2",null,null,null,null,null,null,null,"U11 Girls Heat 2"]
["Pos","Number","Last Name","First Name","Age","Club","Time",null,"Pos","Number","Last Name","First Name","Age","Club","Time"]
[1,326,{"$f":"IFERROR(VLOOKUP(B21,Entries!$A:$E,5,0),\"-\")","v":"Kerr"},{"$f":"IFERROR(VLOOKUP(B21,Entries!$A:$D,4,0),\"-\")","v":"Raheim"},{"$f":"IFERROR(VLOOKUP(B21,Entries!$A:$H,8,0),\"-\")","v":10},{"$f":"IFERROR(VLOOKUP(B21,Entries!$A:$F,6,0),\"-\")","v":"SS Athletics"},null,null,1,48,{"$f":"IFERROR(VLOOKUP(J21,Entries!$A:$E,5,0),\"-\")","v":"Finnegan"},{"$f":"IFERROR(VLOOKUP(J21,Entries!$A:$D,4,0),\"-\")","v":"Sienna"},{"$f":"IFERROR(VLOOKUP(J21,Entries!$A:$H,8,0),\"-\")","v":10},{"$f":"IFERROR(VLOOKUP(J21,Entries!$A:$F,6,0),\"-\")","v":"SS Athletics"},"1.56.59"]
[2,177,{"$f":"IFERROR(VLOOKUP(B22,Entries!$A:$E,5,0),\"-\")","v":"Connor"},{"$f":"IFERROR(VLOOKUP(B22,Entries!$A:$D,4,0),\"-\")","v":"Jax"},{"$f":"IFERROR(VLOOKUP(B22,Entries!$A:$H,8,0),\"-\")","v":10},{"$f":"IFERROR(VLOOKUP(B22,Entries!$A:$F,6,0),\"-\")","v":"Woodford Green AC with Essex Ladies"},"1.52.20",null,2,31,{"$f":"IFERROR(VLOOKUP(J22,Entries!$A:$E,5,0),\"-\")","v":"Jones"},{"$f":"IFERROR(VLOOKUP(J22,Entries!$A:$D,4,0),\"-\")","v":"Evie"},{"$f":"IFERROR(VLOOKUP(J22,Entries!$A:$H,8,0),\"-\")","v":10},{"$f":"IFERROR(VLOOKUP(J22,Entries!$A:$F,6,0),\"-\")","v":"Aldershot Farnham & District"},"1.57.36"]
[3,226,{"$f":"IFERROR(VLOOKUP(B23,Entries!$A:$E,5,0),\"-\")","v":"Jones"},{"$f":"IFERROR(VLOOKUP(B23,Entries!$A:$D,4,0),\"-\")","v":"Oliver"},{"$f":"IFERROR(VLOOKUP(B23,Entries!$A:$H,8,0),\"-\")","v":10},{"$f":"IFERROR(VLOOKUP(B23,Entries!$A:$F,6,0),\"-\")","v":"Unattached"},"1.54.42",null,3,89,{"$f":"IFERROR(VLOOKUP(J23,Entries!$A:$E,5,0),\"-\")","v":"Foy"},{"$f":"IFERROR(VLOOKUP(J23,Entries!$A:$D,4,0),\"-\")","v":"Millie"},{"$f":"IFERROR(VLOOKUP(J23,Entries!$A:$H,8,0),\"-\")","v":10},{"$f":"IFERROR(VLOOKUP(J23,Entries!$A:$F,6,0),\"-\")","v":"SS Athletics"},"2.02.59"]
[4,316,{"$f":"IFERROR(VLOOKUP(B24,Entries!$A:$E,5,0),\"-\")","v":"McNicholl"},{"$f":"IFERROR(VLOOKUP(B24,Entries!$A:$D,4,0),\"-\")","v":"Jude"},{"$f":"IFERROR(VLOOKUP(B24,Entries!$A:$H,8,0),\"-\")","v":10},{"$f":"IFERROR(VLOOKUP(B24,Entries!$A:$F,6,0),\"-\")","v":"Brentwood Beagles Athletics Club"},"1.57.02",null,4,368,{"$f":"IFERROR(VLOOKUP(J24,Entries!$A:$E,5,0),\"-\")","v":"Howard"},{"$f":"IFERROR(VLOOKUP(J24,Entries!$A:$D,4,0),\"-\")","v":"Chloe-Anne"},{"$f":"IFERROR(VLOOKUP(J24,Entries!$A:$H,8,0),\"-\")","v":10},{"$f":"IFERROR(VLOOKUP(J24,Entries!$A:$F,6,0),\"-\")","v":"SS Athletics"},"2.09.08"]
[5,172,{"$f":"IFERROR(VLOOKUP(B25,Entries!$A:$E,5,0),\"-\")","v":"Lupton"},{"$f":"IFERROR(VLOOKUP(B25,Entries!$A:$D,4,0),\"-\")","v":"Joseph"},{"$f":"IFERROR(VLOOKUP(B25,Entries!$A:$H,8,0),\"-\")","v":10},{"$f":"IFERROR(VLOOKUP(B25,Entries!$A:$F,6,0),\"-\")","v":"SS Athletics"},"2.09.86",null,5,9,{"$f":"IFERROR(VLOOKUP(J25,Entries!$A:$E,5,0),\"-\")","v":"Brewington"},{"$f":"IFERROR(VLOOKUP(J25,Entries!$A:$D,4,0),\"-\")","v":"Emily"},{"$f":"IFERROR(VLOOKUP(J25,Entries!$A:$H,8,0),\"-\")","v":10},{"$f":"IFERROR(VLOOKUP(J25,Entries!$A:$F,6,0),\"-\")","v":"Brentwood Beagles Athletics Club"},"2.10.56"]
[6,95,{"$f":"IFERROR(VLOOKUP(B26,Entries!$A:$E,5,0),\"-\")","v":"Evison"},{"$f":"IFERROR(VLOOKUP(B26,Entries!$A:$D,4,0),\"-\")","v":"Oliver"},{"$f":"IFERROR(VLOOKUP(B26,Entries!$A:$H,8,0),\"-\")","v":10},{"$f":"IFERROR(VLOOKUP(B26,Entries!$A:$F,6,0),\"-\")","v":"SS Athletics"},"2.10.63",null,6,272,{"$f":"IFERROR(VLOOKUP(J26,Entries!$A:$E,5,0),\"-\")","v":"Barron"},{"$f":"IFERROR(VLOOKUP(J26,Entries!$A:$D,4,0),\"-\")","v":"Rosie"},{"$f":"IFERROR(VLOOKUP(J26,Entries!$A:$H,8,0),\"-\")","v":10},{"$f":"IFERROR(VLOOKUP(J26,Entries!$A:$F,6,0),\"-\")","v":"Woodford Green AC with Essex Ladies"},"2.11.25"]
[7,212,{"$f":"IFERROR(VLOOKUP(B27,Entries!$A:$E,5,0),\"-\")","v":"Sibanda"},{"$f":"IFERROR(VLOOKUP(B27,Entries!$A:$D,4,0),\"-\")","v":"Malachi"},{"$f":"IFERROR(VLOOKUP(B27,Entries!$A:$H,8,0),\"-\")","v":10},{"$f":"IFERROR(VLOOKUP(B27,Entries!$A:$F,6,0),\"-\")","v":"SS Athletics"},"2.18.08",null,7,236,{"$f":"IFERROR(VLOOKUP(J27,Entries!$A:$E,5,0),\"-\")","v":"Neary"},{"$f":"IFERROR(VLOOKUP(J27,Entries!$A:$D,4,0),\"-\")","v":"Juno"},{"$f":"IFERROR(VLOOKUP(J27,Entries!$A:$H,8,0),\"-\")","v":10},{"$f":"IFERROR(VLOOKUP(J27,Entries!$A:$F,6,0),\"-\")","v":"SS Athletics"},"2.14.28"]
[8,193,{"$f":"IFERROR(VLOOKUP(B28,Entries!$A:$E,5,0),\"-\")","v":"Broad"},{"$f":"IFERROR(VLOOKUP(B28,Entries!$A:$D,4,0),\"-\")","v":"Carter"},{"$f":"IFERROR(VLOOKUP(B28,Entries!$A:$H,8,0),\"-\")","v":10},{"$f":"IFERROR(VLOOKUP(B28,Entries!$A:$F,6,0),\"-\")","v":"Benfleet RC"},"2.20.07",null,8,108,{"$f":"IFERROR(VLOOKUP(J28,Entries!$A:$E,5,0),\"-\")","v":"Silvain"},{"$f":"IFERROR(VLOOKUP(J28,Entries!$A:$D,4,0),\"-\")","v":"Ella"},{"$f":"IFERROR(VLOOKUP(J28,Entries!$A:$H,8,0),\"-\")","v":10},{"$f":"IFERROR(VLOOKUP(J28,Entries!$A:$F,6,0),\"-\")","v":"Unattached"},"2.16.76"]
[9,213,{"$f":"IFERROR(VLOOKUP(B29,Entries!$A:$E,5,0),\"-\")","v":"Connor"},{"$f":"IFERROR(VLOOKUP(B29,Entries!$A:$D,4,0),\"-\")","v":"Patrick"},{"$f":"IFERROR(VLOOKUP(B29,Entries!$A:$H,8,0),\"-\")","v":10},{"$f":"IFERROR(VLOOKUP(B29,Entries!$A:$F,6,0),\"-\")","v":"Brentwood Beagles Athletics Club"},"2.23.58",null,9,49,{"$f":"IFERROR(VLOOKUP(J29,Entries!$A:$E,5,0),\"-\")","v":"Nti-Jackson"},{"$f":"IFERROR(VLOOKUP(J29,Entries!$A:$D,4,0),\"-\")","v":"Danielle"},{"$f":"IFERROR(VLOOKUP(J29,Entries!$A:$H,8,0),\"-\")","v":10},{"$f":"IFERROR(VLOOKUP(J29,Entries!$A:$F,6,0),\"-\")","v":"SS Athletics"},"2.17.25"]
[10,377,{"$f":"IFERROR(VLOOKUP(B30,Entries!$A:$E,5,0),\"-\")","v":"M Kelly"},{"$f":"IFERROR(VLOOKUP(B30,Entries!$A:$D,4,0),\"-\")","v":"Olly"},{"$f":"IFERROR(VLOOKUP(B30,Entries!$A:$H,8,0),\"-\")","v":10},{"$f":"IFERROR(VLOOKUP(B30,Entries!$A:$F,6,0),\"-\")","v":"Ipswich Jaffa RC"},"2.28.52",null,10,375,{"$f":"IFERROR(VLOOKUP(J30,Entries!$A:$E,5,0),\"-\")","v":"Heath"},{"$f":"IFERROR(VLOOKUP(J30,Entries!$A:$D,4,0),\"-\")","v":"Naomi"},{"$f":"IFERROR(VLOOKUP(J30,Entries!$A:$H,8,0),\"-\")","v":10},{"$f":"IFERROR(VLOOKUP(J30,Entries!$A:$F,6,0),\"-\")","v":"SS Athletics"},"2.28.11"]
[null,null,null,null,null,null,null,null,11,171,{"$f":"IFERROR(VLOOKUP(J31,Entries!$A:$E,5,0),\"-\")","v":"Lupton"},{"$f":"IFERROR(VLOOKUP(J31,Entries!$A:$D,4,0),\"-\")","v":"Hollie"},{"$f":"IFERROR(VLOOKUP(J31,Entries!$A:$H,8,0),\"-\")","v":10},{"$f":"IFERROR(VLOOKUP(J31,Entries!$A:$F,6,0),\"-\")","v":"SS Athletics"},"2.28.44"]

{"sheet":"800m","index":12,"n_rows":83,"n_cols":16,"rows_kept":83,"cut":false,"hidden":false,"merged":[]}
["800m"]
[]
["U13 Boys",null,null,null,null,null,null,null,"U13 Girls"]
["Pos","Number","Last Name","First Name","Age","Club","Time",null,"Pos","Number","Last Name","First Name","Age","Club","Time"]
[1,5,{"$f":"IFERROR(VLOOKUP(B5,Entries!$A:$E,5,0),\"-\")","v":"Brown"},{"$f":"IFERROR(VLOOKUP(B5,Entries!$A:$D,4,0),\"-\")","v":"Samuel"},{"$f":"IFERROR(VLOOKUP(B5,Entries!$A:$H,8,0),\"-\")","v":11},{"$f":"IFERROR(VLOOKUP(B5,Entries!$A:$F,6,0),\"-\")","v":"SS Athletics"},"2.26.12",null,1,317,{"$f":"IFERROR(VLOOKUP(J5,Entries!$A:$E,5,0),\"-\")","v":"Kindler"},{"$f":"IFERROR(VLOOKUP(J5,Entries!$A:$D,4,0),\"-\")","v":"Madison"},{"$f":"IFERROR(VLOOKUP(J5,Entries!$A:$H,8,0),\"-\")","v":11},{"$f":"IFERROR(VLOOKUP(J5,Entries!$A:$F,6,0),\"-\")","v":"Brentwood Beagles Athletics Club"},"2.22.3"]
[2,218,{"$f":"IFERROR(VLOOKUP(B6,Entries!$A:$E,5,0),\"-\")","v":"Haynes"},{"$f":"IFERROR(VLOOKUP(B6,Entries!$A:$D,4,0),\"-\")","v":"Dexter"},{"$f":"IFERROR(VLOOKUP(B6,Entries!$A:$H,8,0),\"-\")","v":12},{"$f":"IFERROR(VLOOKUP(B6,Entries!$A:$F,6,0),\"-\")","v":"SS Athletics"},"2.40.97",null,2,159,{"$f":"IFERROR(VLOOKUP(J6,Entries!$A:$E,5,0),\"-\")","v":"Carver"},{"$f":"IFERROR(VLOOKUP(J6,Entries!$A:$D,4,0),\"-\")","v":"Katie"},{"$f":"IFERROR(VLOOKUP(J6,Entries!$A:$H,8,0),\"-\")","v":12},{"$f":"IFERROR(VLOOKUP(J6,Entries!$A:$F,6,0),\"-\")","v":"SS Athletics"},"2.38.3"]
[3,8,{"$f":"IFERROR(VLOOKUP(B7,Entries!$A:$E,5,0),\"-\")","v":"Armour"},{"$f":"IFERROR(VLOOKUP(B7,Entries!$A:$D,4,0),\"-\")","v":"Adam"},{"$f":"IFERROR(VLOOKUP(B7,Entries!$A:$H,8,0),\"-\")","v":12},{"$f":"IFERROR(VLOOKUP(B7,Entries!$A:$F,6,0),\"-\")","v":"Brentwood Beagles Athletics Club"},"2.45.67",null,3,268,{"$f":"IFERROR(VLOOKUP(J7,Entries!$A:$E,5,0),\"-\")","v":"Martin"},{"$f":"IFERROR(VLOOKUP(J7,Entries!$A:$D,4,0),\"-\")","v":"Orla"},{"$f":"IFERROR(VLOOKUP(J7,Entries!$A:$H,8,0),\"-\")","v":12},{"$f":"IFERROR(VLOOKUP(J7,Entries!$A:$F,6,0),\"-\")","v":"Chelmsford AC"},"2.38.5"]
[4,163,{"$f":"IFERROR(VLOOKUP(B8,Entries!$A:$E,5,0),\"-\")","v":"Birnie"},{"$f":"IFERROR(VLOOKUP(B8,Entries!$A:$D,4,0),\"-\")","v":"Ryan"},{"$f":"IFERROR(VLOOKUP(B8,Entries!$A:$H,8,0),\"-\")","v":11},{"$f":"IFERROR(VLOOKUP(B8,Entries!$A:$F,6,0),\"-\")","v":"SS Athletics"},"2.45.91",null,4,235,{"$f":"IFERROR(VLOOKUP(J8,Entries!$A:$E,5,0),\"-\")","v":"Finlay"},{"$f":"IFERROR(VLOOKUP(J8,Entries!$A:$D,4,0),\"-\")","v":"Scarlett"},{"$f":"IFERROR(VLOOKUP(J8,Entries!$A:$H,8,0),\"-\")","v":11},{"$f":"IFERROR(VLOOKUP(J8,Entries!$A:$F,6,0),\"-\")","v":"Watford Harriers"},"2.38.7"]
[5,330,{"$f":"IFERROR(VLOOKUP(B9,Entries!$A:$E,5,0),\"-\")","v":"King-McLeod"},{"$f":"IFERROR(VLOOKUP(B9,Entries!$A:$D,4,0),\"-\")","v":"Jackson"},{"$f":"IFERROR(VLOOKUP(B9,Entries!$A:$H,8,0),\"-\")","v":11},{"$f":"IFERROR(VLOOKUP(B9,Entries!$A:$F,6,0),\"-\")","v":"Benfleet RC"},"2.50.30",null,5,72,{"$f":"IFERROR(VLOOKUP(J9,Entries!$A:$E,5,0),\"-\")","v":"Twydell"},{"$f":"IFERROR(VLOOKUP(J9,Entries!$A:$D,4,0),\"-\")","v":"Amalie"},{"$f":"IFERROR(VLOOKUP(J9,Entries!$A:$H,8,0),\"-\")","v":12},{"$f":"IFERROR(VLOOKUP(J9,Entries!$A:$F,6,0),\"-\")","v":"Brentwood Beagles Athletics Club"},"2.45.1"]
[6,219,{"$f":"IFERROR(VLOOKUP(B10,Entries!$A:$E,5,0),\"-\")","v":"Baker Durchslag"},{"$f":"IFERROR(VLOOKUP(B10,Entries!$A:$D,4,0),\"-\")","v":"Aaron"},{"$f":"IFERROR(VLOOKUP(B10,Entries!$A:$H,8,0),\"-\")","v":11},{"$f":"IFERROR(VLOOKUP(B10,Entries!$A:$F,6,0),\"-\")","v":"SS Athletics"},"2.57.47",null,6,347,{"$f":"IFERROR(VLOOKUP(J10,Entries!$A:$E,5,0),\"-\")","v":"Crawford"},{"$f":"IFERROR(VLOOKUP(J10,Entries!$A:$D,4,0),\"-\")","v":"Grace"},{"$f":"IFERROR(VLOOKUP(J10,Entries!$A:$H,8,0),\"-\")","v":11},{"$f":"IFERROR(VLOOKUP(J10,Entries!$A:$F,6,0),\"-\")","v":"SS Athletics"},"2.53.2"]
[7,158,{"$f":"IFERROR(VLOOKUP(B11,Entries!$A:$E,5,0),\"-\")","v":"Lipscombe"},{"$f":"IFERROR(VLOOKUP(B11,Entries!$A:$D,4,0),\"-\")","v":"Jude"},{"$f":"IFERROR(VLOOKUP(B11,Entries!$A:$H,8,0),\"-\")","v":11},{"$f":"IFERROR(VLOOKUP(B11,Entries!$A:$F,6,0),\"-\")","v":"SS Athletics"},"3.00.20",null,7,332,{"$f":"IFERROR(VLOOKUP(J11,Entries!$A:$E,5,0),\"-\")","v":"King-McLeod"},{"$f":"IFERROR(VLOOKUP(J11,Entries!$A:$D,4,0),\"-\")","v":"Nevaeh"},{"$f":"IFERROR(VLOOKUP(J11,Entries!$A:$H,8,0),\"-\")","v":11},{"$f":"IFERROR(VLOOKUP(J11,Entries!$A:$F,6,0),\"-\")","v":"Benfleet RC"},"3.04.7"]
[8,286,{"$f":"IFERROR(VLOOKUP(B12,Entries!$A:$E,5,0),\"-\")","v":"Heaton"},{"$f":"IFERROR(VLOOKUP(B12,Entries!$A:$D,4,0),\"-\")","v":"Alex"},{"$f":"IFERROR(VLOOKUP(B12,Entries!$A:$H,8,0),\"-\")","v":11},{"$f":"IFERROR(VLOOKUP(B12,Entries!$A:$F,6,0),\"-\")","v":"Castle Point Joggers"},"3.16.59",null,8,22,{"$f":"IFERROR(VLOOKUP(J12,Entries!$A:$E,5,0),\"-\")","v":"Amadin"},{"$f":"IFERROR(VLOOKUP(J12,Entries!$A:$D,4,0),\"-\")","v":"Amenze"},{"$f":"IFERROR(VLOOKUP(J12,Entries!$A:$H,8,0),\"-\")","v":12},{"$f":"IFERROR(VLOOKUP(J12,Entries!$A:$F,6,0),\"-\")","v":"City of Southend On Sea AC"},"3.07.7"]
[9,null,{"$f":"IFERROR(VLOOKUP(B13,Entries!$A:$E,5,0),\"-\")","v":"-"},{"$f":"IFERROR(VLOOKUP(B13,Entries!$A:$D,4,0),\"-\")","v":"-"},{"$f":"IFERROR(VLOOKUP(B13,Entries!$A:$H,8,0),\"-\")","v":"-"},{"$f":"IFERROR(VLOOKUP(B13,Entries!$A:$F,6,0),\"-\")","v":"-"},null,null,9,309,{"$f":"IFERROR(VLOOKUP(J13,Entries!$A:$E,5,0),\"-\")","v":"Sandell"},{"$f":"IFERROR(VLOOKUP(J13,Entries!$A:$D,4,0),\"-\")","v":"Anais"},{"$f":"IFERROR(VLOOKUP(J13,Entries!$A:$H,8,0),\"-\")","v":12},{"$f":"IFERROR(VLOOKUP(J13,Entries!$A:$F,6,0),\"-\")","v":"SS Athletics"},"3.08.2"]
[10,null,{"$f":"IFERROR(VLOOKUP(B14,Entries!$A:$E,5,0),\"-\")","v":"-"},{"$f":"IFERROR(VLOOKUP(B14,Entries!$A:$D,4,0),\"-\")","v":"-"},{"$f":"IFERROR(VLOOKUP(B14,Entries!$A:$H,8,0),\"-\")","v":"-"},{"$f":"IFERROR(VLOOKUP(B14,Entries!$A:$F,6,0),\"-\")","v":"-"},null,null,10,315,{"$f":"IFERROR(VLOOKUP(J14,Entries!$A:$E,5,0),\"-\")","v":"Turner"},{"$f":"IFERROR(VLOOKUP(J14,Entries!$A:$D,4,0),\"-\")","v":"Amelia-Rose"},{"$f":"IFERROR(VLOOKUP(J14,Entries!$A:$H,8,0),\"-\")","v":11},{"$f":"IFERROR(VLOOKUP(J14,Entries!$A:$F,6,0),\"-\")","v":"SS Athletics"},"3.20.9"]
[11,null,{"$f":"IFERROR(VLOOKUP(B15,Entries!$A:$E,5,0),\"-\")","v":"-"},{"$f":"IFERROR(VLOOKUP(B15,Entries!$A:$D,4,0),\"-\")","v":"-"},{"$f":"IFERROR(VLOOKUP(B15,Entries!$A:$H,8,0),\"-\")","v":"-"},{"$f":"IFERROR(VLOOKUP(B15,Entries!$A:$F,6,0),\"-\")","v":"-"},null,null,11,null,{"$f":"IFERROR(VLOOKUP(J15,Entries!$A:$E,5,0),\"-\")","v":"-"},{"$f":"IFERROR(VLOOKUP(J15,Entries!$A:$D,4,0),\"-\")","v":"-"},{"$f":"IFERROR(VLOOKUP(J15,Entries!$A:$H,8,0),\"-\")","v":"-"},{"$f":"IFERROR(VLOOKUP(J15,Entries!$A:$F,6,0),\"-\")","v":"-"}]
[12,null,{"$f":"IFERROR(VLOOKUP(B16,Entries!$A:$E,5,0),\"-\")","v":"-"},{"$f":"IFERROR(VLOOKUP(B16,Entries!$A:$D,4,0),\"-\")","v":"-"},{"$f":"IFERROR(VLOOKUP(B16,Entries!$A:$H,8,0),\"-\")","v":"-"},{"$f":"IFERROR(VLOOKUP(B16,Entries!$A:$F,6,0),\"-\")","v":"-"},null,null,12,null,{"$f":"IFERROR(VLOOKUP(J16,Entries!$A:$E,5,0),\"-\")","v":"-"},{"$f":"IFERROR(VLOOKUP(J16,Entries!$A:$D,4,0),\"-\")","v":"-"},{"$f":"IFERROR(VLOOKUP(J16,Entries!$A:$H,8,0),\"-\")","v":"-"},{"$f":"IFERROR(VLOOKUP(J16,Entries!$A:$F,6,0),\"-\")","v":"-"}]
[]
[]
["U15 Boys",null,null,null,null,null,null,null,"U15 Girls"]
["Pos","Number","Last Name","First Name","Age","Club","Time",null,"Pos","Number","Last Name","First Name","Age","Club","Time"]
[1,247,{"$f":"IFERROR(VLOOKUP(B21,Entries!$A:$E,5,0),\"-\")","v":"Kelly"},{"$f":"IFERROR(VLOOKUP(B21,Entries!$A:$D,4,0),\"-\")","v":"Alfie"},{"$f":"IFERROR(VLOOKUP(B21,Entries!$A:$H,8,0),\"-\")","v":13},{"$f":"IFERROR(VLOOKUP(B21,Entries!$A:$F,6,0),\"-\")","v":"Ipswich Jaffa RC"},"2.15.7",null,1,165,{"$f":"IFERROR(VLOOKUP(J21,Entries!$A:$E,5,0),\"-\")","v":"Tiller"},{"$f":"IFERROR(VLOOKUP(J21,Entries!$A:$D,4,0),\"-\")","v":"Missy"},{"$f":"IFERROR(VLOOKUP(J21,Entries!$A:$H,8,0),\"-\")","v":14},{"$f":"IFERROR(VLOOKUP(J21,Entries!$A:$F,6,0),\"-\")","v":"Brentwood Beagles Athletics Club"},"2.22.1"]
[2,155,{"$f":"IFERROR(VLOOKUP(B22,Entries!$A:$E,5,0),\"-\")","v":"Evans"},{"$f":"IFERROR(VLOOKUP(B22,Entries!$A:$D,4,0),\"-\")","v":"Jack"},{"$f":"IFERROR(VLOOKUP(B22,Entries!$A:$H,8,0),\"-\")","v":14},{"$f":"IFERROR(VLOOKUP(B22,Entries!$A:$F,6,0),\"-\")","v":"Herts Phoenix AC"},"2.19.5",null,2,333,{"$f":"IFERROR(VLOOKUP(J22,Entries!$A:$E,5,0),\"-\")","v":"Smith"},{"$f":"IFERROR(VLOOKUP(J22,Entries!$A:$D,4,0),\"-\")","v":"Summer"},{"$f":"IFERROR(VLOOKUP(J22,Entries!$A:$H,8,0),\"-\")","v":13},{"$f":"IFERROR(VLOOKUP(J22,Entries!$A:$F,6,0),\"-\")","v":"Brentwood Beagles Athletics Club"},"2.25.9"]
[3,372,{"$f":"IFERROR(VLOOKUP(B23,Entries!$A:$E,5,0),\"-\")","v":"Mendoza"},{"$f":"IFERROR(VLOOKUP(B23,Entries!$A:$D,4,0),\"-\")","v":"Jackson"},{"$f":"IFERROR(VLOOKUP(B23,Entries!$A:$H,8,0),\"-\")","v":14},{"$f":"IFERROR(VLOOKUP(B23,Entries!$A:$F,6,0),\"-\")","v":"City of Southend On Sea AC"},"2.21.0",null,3,190,{"$f":"IFERROR(VLOOKUP(J23,Entries!$A:$E,5,0),\"-\")","v":"Rogers"},{"$f":"IFERROR(VLOOKUP(J23,Entries!$A:$D,4,0),\"-\")","v":"Sophie"},{"$f":"IFERROR(VLOOKUP(J23,Entries!$A:$H,8,0),\"-\")","v":14},{"$f":"IFERROR(VLOOKUP(J23,Entries!$A:$F,6,0),\"-\")","v":"Colchester Harriers AC"},"2.29.9"]
[4,184,{"$f":"IFERROR(VLOOKUP(B24,Entries!$A:$E,5,0),\"-\")","v":"Langshaw"},{"$f":"IFERROR(VLOOKUP(B24,Entries!$A:$D,4,0),\"-\")","v":"Max"},{"$f":"IFERROR(VLOOKUP(B24,Entries!$A:$H,8,0),\"-\")","v":14},{"$f":"IFERROR(VLOOKUP(B24,Entries!$A:$F,6,0),\"-\")","v":"Basildon AC"},"2.22.4",null,4,12,{"$f":"IFERROR(VLOOKUP(J24,Entries!$A:$E,5,0),\"-\")","v":"Wallace"},{"$f":"IFERROR(VLOOKUP(J24,Entries!$A:$D,4,0),\"-\")","v":"Florence"},{"$f":"IFERROR(VLOOKUP(J24,Entries!$A:$H,8,0),\"-\")","v":14},{"$f":"IFERROR(VLOOKUP(J24,Entries!$A:$F,6,0),\"-\")","v":"City of Southend On Sea AC"},"2.36.6"]
[5,341,{"$f":"IFERROR(VLOOKUP(B25,Entries!$A:$E,5,0),\"-\")","v":"Preston"},{"$f":"IFERROR(VLOOKUP(B25,Entries!$A:$D,4,0),\"-\")","v":"Hayden"},{"$f":"IFERROR(VLOOKUP(B25,Entries!$A:$H,8,0),\"-\")","v":13},{"$f":"IFERROR(VLOOKUP(B25,Entries!$A:$F,6,0),\"-\")","v":"Colchester Harriers AC"},"2.29.8",null,5,204,{"$f":"IFERROR(VLOOKUP(J25,Entries!$A:$E,5,0),\"-\")","v":"Middlemiss"},{"$f":"IFERROR(VLOOKUP(J25,Entries!$A:$D,4,0),\"-\")","v":"Daisy"},{"$f":"IFERROR(VLOOKUP(J25,Entries!$A:$H,8,0),\"-\")","v":14},{"$f":"IFERROR(VLOOKUP(J25,Entries!$A:$F,6,0),\"-\")","v":"Unattached"},"2.43.3"]
[6,227,{"$f":"IFERROR(VLOOKUP(B26,Entries!$A:$E,5,0),\"-\")","v":"Ulyatt"},{"$f":"IFERROR(VLOOKUP(B26,Entries!$A:$D,4,0),\"-\")","v":"Tom"},{"$f":"IFERROR(VLOOKUP(B26,Entries!$A:$H,8,0),\"-\")","v":14},{"$f":"IFERROR(VLOOKUP(B26,Entries!$A:$F,6,0),\"-\")","v":"Loughton AC"},"2.35.0",null,6,169,{"$f":"IFERROR(VLOOKUP(J26,Entries!$A:$E,5,0),\"-\")","v":"Bailey"},{"$f":"IFERROR(VLOOKUP(J26,Entries!$A:$D,4,0),\"-\")","v":"Heidi"},{"$f":"IFERROR(VLOOKUP(J26,Entries!$A:$H,8,0),\"-\")","v":13},{"$f":"IFERROR(VLOOKUP(J26,Entries!$A:$F,6,0),\"-\")","v":"Basildon AC"},"2.46.9"]
[7,251,{"$f":"IFERROR(VLOOKUP(B27,Entries!$A:$E,5,0),\"-\")","v":"Jones"},{"$f":"IFERROR(VLOOKUP(B27,Entries!$A:$D,4,0),\"-\")","v":"Matthew"},{"$f":"IFERROR(VLOOKUP(B27,Entries!$A:$H,8,0),\"-\")","v":14},{"$f":"IFERROR(VLOOKUP(B27,Entries!$A:$F,6,0),\"-\")","v":"Brentwood Beagles Athletics Club"},"2.37.0",null,7,189,{"$f":"IFERROR(VLOOKUP(J27,Entries!$A:$E,5,0),\"-\")","v":"Wallis"},{"$f":"IFERROR(VLOOKUP(J27,Entries!$A:$D,4,0),\"-\")","v":"Darcey"},{"$f":"IFERROR(VLOOKUP(J27,Entries!$A:$H,8,0),\"-\")","v":13},{"$f":"IFERROR(VLOOKUP(J27,Entries!$A:$F,6,0),\"-\")","v":"Basildon AC"},"2.47.7"]
[8,null,{"$f":"IFERROR(VLOOKUP(B28,Entries!$A:$E,5,0),\"-\")","v":"-"},{"$f":"IFERROR(VLOOKUP(B28,Entries!$A:$D,4,0),\"-\")","v":"-"},{"$f":"IFERROR(VLOOKUP(B28,Entries!$A:$H,8,0),\"-\")","v":"-"},{"$f":"IFERROR(VLOOKUP(B28,Entries!$A:$F,6,0),\"-\")","v":"-"},null,null,8,58,{"$f":"IFERROR(VLOOKUP(J28,Entries!$A:$E,5,0),\"-\")","v":"Gray"},{"$f":"IFERROR(VLOOKUP(J28,Entries!$A:$D,4,0),\"-\")","v":"Amalia"},{"$f":"IFERROR(VLOOKUP(J28,Entries!$A:$H,8,0),\"-\")","v":14},{"$f":"IFERROR(VLOOKUP(J28,Entries!$A:$F,6,0),\"-\")","v":"City of Southend On Sea AC"},"2.51.0"]
[9,null,{"$f":"IFERROR(VLOOKUP(B29,Entries!$A:$E,5,0),\"-\")","v":"-"},{"$f":"IFERROR(VLOOKUP(B29,Entries!$A:$D,4,0),\"-\")","v":"-"},{"$f":"IFERROR(VLOOKUP(B29,Entries!$A:$H,8,0),\"-\")","v":"-"},{"$f":"IFERROR(VLOOKUP(B29,Entries!$A:$F,6,0),\"-\")","v":"-"},null,null,9,73,{"$f":"IFERROR(VLOOKUP(J29,Entries!$A:$E,5,0),\"-\")","v":"Sladden"},{"$f":"IFERROR(VLOOKUP(J29,Entries!$A:$D,4,0),\"-\")","v":"Dakota"},{"$f":"IFERROR(VLOOKUP(J29,Entries!$A:$H,8,0),\"-\")","v":14},{"$f":"IFERROR(VLOOKUP(J29,Entries!$A:$F,6,0),\"-\")","v":"SS Athletics"},"2.59.4"]
[10,null,{"$f":"IFERROR(VLOOKUP(B30,Entries!$A:$E,5,0),\"-\")","v":"-"},{"$f":"IFERROR(VLOOKUP(B30,Entries!$A:$D,4,0),\"-\")","v":"-"},{"$f":"IFERROR(VLOOKUP(B30,Entries!$A:$H,8,0),\"-\")","v":"-"},{"$f":"IFERROR(VLOOKUP(B30,Entries!$A:$F,6,0),\"-\")","v":"-"},null,null,10,null,{"$f":"IFERROR(VLOOKUP(J30,Entries!$A:$E,5,0),\"-\")","v":"-"},{"$f":"IFERROR(VLOOKUP(J30,Entries!$A:$D,4,0),\"-\")","v":"-"},{"$f":"IFERROR(VLOOKUP(J30,Entries!$A:$H,8,0),\"-\")","v":"-"},{"$f":"IFERROR(VLOOKUP(J30,Entries!$A:$F,6,0),\"-\")","v":"-"}]
[]
[]
["U17 Men",null,null,null,null,null,null,null,"U17 Women"]
["Pos","Number","Last Name","First Name","Age","Club","Time",null,"Pos","Number","Last Name","First Name","Age","Club","Time"]
[1,327,{"$f":"IFERROR(VLOOKUP(B35,Entries!$A:$E,5,0),\"-\")","v":"Adesanya"},{"$f":"IFERROR(VLOOKUP(B35,Entries!$A:$D,4,0),\"-\")","v":"Andrew"},{"$f":"IFERROR(VLOOKUP(B35,Entries!$A:$H,8,0),\"-\")","v":16},{"$f":"IFERROR(VLOOKUP(B35,Entries!$A:$F,6,0),\"-\")","v":"City of Southend On Sea AC"},"2.00.2",null,1,59,{"$f":"IFERROR(VLOOKUP(J35,Entries!$A:$E,5,0),\"-\")","v":"Sandercock"},{"$f":"IFERROR(VLOOKUP(J35,Entries!$A:$D,4,0),\"-\")","v":"Naomi"},{"$f":"IFERROR(VLOOKUP(J35,Entries!$A:$H,8,0),\"-\")","v":15},{"$f":"IFERROR(VLOOKUP(J35,Entries!$A:$F,6,0),\"-\")","v":"Colchester & Tendring AC"},"2.20.09"]
[2,340,{"$f":"IFERROR(VLOOKUP(B36,Entries!$A:$E,5,0),\"-\")","v":"Lee"},{"$f":"IFERROR(VLOOKUP(B36,Entries!$A:$D,4,0),\"-\")","v":"Caleb"},{"$f":"IFERROR(VLOOKUP(B36,Entries!$A:$H,8,0),\"-\")","v":16},{"$f":"IFERROR(VLOOKUP(B36,Entries!$A:$F,6,0),\"-\")","v":"Colchester Harriers AC"},"2.14.1",null,2,290,{"$f":"IFERROR(VLOOKUP(J36,Entries!$A:$E,5,0),\"-\")","v":"Walker"},{"$f":"IFERROR(VLOOKUP(J36,Entries!$A:$D,4,0),\"-\")","v":"Jessica"},{"$f":"IFERROR(VLOOKUP(J36,Entries!$A:$H,8,0),\"-\")","v":15},{"$f":"IFERROR(VLOOKUP(J36,Entries!$A:$F,6,0),\"-\")","v":"City of Southend On Sea AC"},"2.23.62"]
[3,null,{"$f":"IFERROR(VLOOKUP(B37,Entries!$A:$E,5,0),\"-\")","v":"-"},{"$f":"IFERROR(VLOOKUP(B37,Entries!$A:$D,4,0),\"-\")","v":"-"},{"$f":"IFERROR(VLOOKUP(B37,Entries!$A:$H,8,0),\"-\")","v":"-"},{"$f":"IFERROR(VLOOKUP(B37,Entries!$A:$F,6,0),\"-\")","v":"-"},null,null,3,57,{"$f":"IFERROR(VLOOKUP(J37,Entries!$A:$E,5,0),\"-\")","v":"Fotherby"},{"$f":"IFERROR(VLOOKUP(J37,Entries!$A:$D,4,0),\"-\")","v":"Chloe"},{"$f":"IFERROR(VLOOKUP(J37,Entries!$A:$H,8,0),\"-\")","v":15},{"$f":"IFERROR(VLOOKUP(J37,Entries!$A:$F,6,0),\"-\")","v":"City of Southend On Sea AC"},"2.32.56"]
[4,null,{"$f":"IFERROR(VLOOKUP(B38,Entries!$A:$E,5,0),\"-\")","v":"-"},{"$f":"IFERROR(VLOOKUP(B38,Entries!$A:$D,4,0),\"-\")","v":"-"},{"$f":"IFERROR(VLOOKUP(B38,Entries!$A:$H,8,0),\"-\")","v":"-"},{"$f":"IFERROR(VLOOKUP(B38,Entries!$A:$F,6,0),\"-\")","v":"-"},null,null,4,337,{"$f":"IFERROR(VLOOKUP(J38,Entries!$A:$E,5,0),\"-\")","v":"Heath"},{"$f":"IFERROR(VLOOKUP(J38,Entries!$A:$D,4,0),\"-\")","v":"Jessica"},{"$f":"IFERROR(VLOOKUP(J38,Entries!$A:$H,8,0),\"-\")","v":16},{"$f":"IFERROR(VLOOKUP(J38,Entries!$A:$F,6,0),\"-\")","v":"Basildon AC"},"2.59.84"]
[5,null,{"$f":"IFERROR(VLOOKUP(B39,Entries!$A:$E,5,0),\"-\")","v":"-"},{"$f":"IFERROR(VLOOKUP(B39,Entries!$A:$D,4,0),\"-\")","v":"-"},{"$f":"IFERROR(VLOOKUP(B39,Entries!$A:$H,8,0),\"-\")","v":"-"},{"$f":"IFERROR(VLOOKUP(B39,Entries!$A:$F,6,0),\"-\")","v":"-"},null,null,5]
[6,null,{"$f":"IFERROR(VLOOKUP(B40,Entries!$A:$E,5,0),\"-\")","v":"-"},{"$f":"IFERROR(VLOOKUP(B40,Entries!$A:$D,4,0),\"-\")","v":"-"},{"$f":"IFERROR(VLOOKUP(B40,Entries!$A:$H,8,0),\"-\")","v":"-"},{"$f":"IFERROR(VLOOKUP(B40,Entries!$A:$F,6,0),\"-\")","v":"-"},null,null,6]
[7,null,{"$f":"IFERROR(VLOOKUP(B41,Entries!$A:$E,5,0),\"-\")","v":"-"},{"$f":"IFERROR(VLOOKUP(B41,Entries!$A:$D,4,0),\"-\")","v":"-"},{"$f":"IFERROR(VLOOKUP(B41,Entries!$A:$H,8,0),\"-\")","v":"-"},{"$f":"IFERROR(VLOOKUP(B41,Entries!$A:$F,6,0),\"-\")","v":"-"},null,null,7]
[8,null,{"$f":"IFERROR(VLOOKUP(B42,Entries!$A:$E,5,0),\"-\")","v":"-"},{"$f":"IFERROR(VLOOKUP(B42,Entries!$A:$D,4,0),\"-\")","v":"-"},{"$f":"IFERROR(VLOOKUP(B42,Entries!$A:$H,8,0),\"-\")","v":"-"},{"$f":"IFERROR(VLOOKUP(B42,Entries!$A:$F,6,0),\"-\")","v":"-"},null,null,8]
[]
[]
["U20 Men",null,null,null,null,null,null,null,"Senior Women",null,null,null,null,null,null," "]
["Pos","Number","Last Name","First Name","Age","Club","Time",null,"Pos","Number","Last Name","First Name","Age","Club","Time"]
[1,225,{"$f":"IFERROR(VLOOKUP(B47,Entries!$A:$E,5,0),\"-\")","v":"Robinson"},{"$f":"IFERROR(VLOOKUP(B47,Entries!$A:$D,4,0),\"-\")","v":"Joshua"},{"$f":"IFERROR(VLOOKUP(B47,Entries!$A:$H,8,0),\"-\")","v":18},{"$f":"IFERROR(VLOOKUP(B47,Entries!$A:$F,6,0),\"-\")","v":"City of Southend On Sea AC"},"1.59.8",null,1,296,{"$f":"IFERROR(VLOOKUP(J47,Entries!$A:$E,5,0),\"-\")","v":"Matthews Smith"},{"$f":"IFERROR(VLOOKUP(J47,Entries!$A:$D,4,0),\"-\")","v":"Annabel Nicola"},{"$f":"IFERROR(VLOOKUP(J47,Entries!$A:$H,8,0),\"-\")","v":28},{"$f":"IFERROR(VLOOKUP(J47,Entries!$A:$F,6,0),\"-\")","v":"City of Southend On Sea AC"},"2.41.45"]
[2,367,{"$f":"IFERROR(VLOOKUP(B48,Entries!$A:$E,5,0),\"-\")","v":"Savery"},{"$f":"IFERROR(VLOOKUP(B48,Entries!$A:$D,4,0),\"-\")","v":"Dean"},{"$f":"IFERROR(VLOOKUP(B48,Entries!$A:$H,8,0),\"-\")","v":18},{"$f":"IFERROR(VLOOKUP(B48,Entries!$A:$F,6,0),\"-\")","v":"Brentwood Beagles Athletics Club"},"2.06.9",null,2,302,{"$f":"IFERROR(VLOOKUP(J48,Entries!$A:$E,5,0),\"-\")","v":"O'Rourke"},{"$f":"IFERROR(VLOOKUP(J48,Entries!$A:$D,4,0),\"-\")","v":"Rebecca"},{"$f":"IFERROR(VLOOKUP(J48,Entries!$A:$H,8,0),\"-\")","v":21},{"$f":"IFERROR(VLOOKUP(J48,Entries!$A:$F,6,0),\"-\")","v":"Havering AC"},"2.47.95"]
[3,null,{"$f":"IFERROR(VLOOKUP(B49,Entries!$A:$E,5,0),\"-\")","v":"-"},{"$f":"IFERROR(VLOOKUP(B49,Entries!$A:$D,4,0),\"-\")","v":"-"},{"$f":"IFERROR(VLOOKUP(B49,Entries!$A:$H,8,0),\"-\")","v":"-"},{"$f":"IFERROR(VLOOKUP(B49,Entries!$A:$F,6,0),\"-\")","v":"-"},null,null,3,231,{"$f":"IFERROR(VLOOKUP(J49,Entries!$A:$E,5,0),\"-\")","v":"Hopper"},{"$f":"IFERROR(VLOOKUP(J49,Entries!$A:$D,4,0),\"-\")","v":"Laura"},{"$f":"IFERROR(VLOOKUP(J49,Entries!$A:$H,8,0),\"-\")","v":23},{"$f":"IFERROR(VLOOKUP(J49,Entries!$A:$F,6,0),\"-\")","v":"London City Runners"},"2.56.61"]
[4,null,{"$f":"IFERROR(VLOOKUP(B50,Entries!$A:$E,5,0),\"-\")","v":"-"},{"$f":"IFERROR(VLOOKUP(B50,Entries!$A:$D,4,0),\"-\")","v":"-"},{"$f":"IFERROR(VLOOKUP(B50,Entries!$A:$H,8,0),\"-\")","v":"-"},{"$f":"IFERROR(VLOOKUP(B50,Entries!$A:$F,6,0),\"-\")","v":"-"},null,null,4,null,{"$f":"IFERROR(VLOOKUP(J50,Entries!$A:$E,5,0),\"-\")","v":"-"},{"$f":"IFERROR(VLOOKUP(J50,Entries!$A:$D,4,0),\"-\")","v":"-"},{"$f":"IFERROR(VLOOKUP(J50,Entries!$A:$H,8,0),\"-\")","v":"-"},{"$f":"IFERROR(VLOOKUP(J50,Entries!$A:$F,6,0),\"-\")","v":"-"}]
[5,null,{"$f":"IFERROR(VLOOKUP(B51,Entries!$A:$E,5,0),\"-\")","v":"-"},{"$f":"IFERROR(VLOOKUP(B51,Entries!$A:$D,4,0),\"-\")","v":"-"},{"$f":"IFERROR(VLOOKUP(B51,Entries!$A:$H,8,0),\"-\")","v":"-"},{"$f":"IFERROR(VLOOKUP(B51,Entries!$A:$F,6,0),\"-\")","v":"-"},null,null,5,null,{"$f":"IFERROR(VLOOKUP(J51,Entries!$A:$E,5,0),\"-\")","v":"-"},{"$f":"IFERROR(VLOOKUP(J51,Entries!$A:$D,4,0),\"-\")","v":"-"},{"$f":"IFERROR(VLOOKUP(J51,Entries!$A:$H,8,0),\"-\")","v":"-"},{"$f":"IFERROR(VLOOKUP(J51,Entries!$A:$F,6,0),\"-\")","v":"-"}]
[6,null,{"$f":"IFERROR(VLOOKUP(B52,Entries!$A:$E,5,0),\"-\")","v":"-"},{"$f":"IFERROR(VLOOKUP(B52,Entries!$A:$D,4,0),\"-\")","v":"-"},{"$f":"IFERROR(VLOOKUP(B52,Entries!$A:$H,8,0),\"-\")","v":"-"},{"$f":"IFERROR(VLOOKUP(B52,Entries!$A:$F,6,0),\"-\")","v":"-"},null,null,6,null,{"$f":"IFERROR(VLOOKUP(J52,Entries!$A:$E,5,0),\"-\")","v":"-"},{"$f":"IFERROR(VLOOKUP(J52,Entries!$A:$D,4,0),\"-\")","v":"-"},{"$f":"IFERROR(VLOOKUP(J52,Entries!$A:$H,8,0),\"-\")","v":"-"},{"$f":"IFERROR(VLOOKUP(J52,Entries!$A:$F,6,0),\"-\")","v":"-"}]
[7,null,{"$f":"IFERROR(VLOOKUP(B53,Entries!$A:$E,5,0),\"-\")","v":"-"},{"$f":"IFERROR(VLOOKUP(B53,Entries!$A:$D,4,0),\"-\")","v":"-"},{"$f":"IFERROR(VLOOKUP(B53,Entries!$A:$H,8,0),\"-\")","v":"-"},{"$f":"IFERROR(VLOOKUP(B53,Entries!$A:$F,6,0),\"-\")","v":"-"},null,null,7,null,{"$f":"IFERROR(VLOOKUP(J53,Entries!$A:$E,5,0),\"-\")","v":"-"},{"$f":"IFERROR(VLOOKUP(J53,Entries!$A:$D,4,0),\"-\")","v":"-"},{"$f":"IFERROR(VLOOKUP(J53,Entries!$A:$H,8,0),\"-\")","v":"-"},{"$f":"IFERROR(VLOOKUP(J53,Entries!$A:$F,6,0),\"-\")","v":"-"}]
[8,null,{"$f":"IFERROR(VLOOKUP(B54,Entries!$A:$E,5,0),\"-\")","v":"-"},{"$f":"IFERROR(VLOOKUP(B54,Entries!$A:$D,4,0),\"-\")","v":"-"},{"$f":"IFERROR(VLOOKUP(B54,Entries!$A:$H,8,0),\"-\")","v":"-"},{"$f":"IFERROR(VLOOKUP(B54,Entries!$A:$F,6,0),\"-\")","v":"-"},null,null,8,null,{"$f":"IFERROR(VLOOKUP(J54,Entries!$A:$E,5,0),\"-\")","v":"-"},{"$f":"IFERROR(VLOOKUP(J54,Entries!$A:$D,4,0),\"-\")","v":"-"},{"$f":"IFERROR(VLOOKUP(J54,Entries!$A:$H,8,0),\"-\")","v":"-"},{"$f":"IFERROR(VLOOKUP(J54,Entries!$A:$F,6,0),\"-\")","v":"-"}]
[9,null,{"$f":"IFERROR(VLOOKUP(B55,Entries!$A:$E,5,0),\"-\")","v":"-"},{"$f":"IFERROR(VLOOKUP(B55,Entries!$A:$D,4,0),\"-\")","v":"-"},{"$f":"IFERROR(VLOOKUP(B55,Entries!$A:$H,8,0),\"-\")","v":"-"},{"$f":"IFERROR(VLOOKUP(B55,Entries!$A:$F,6,0),\"-\")","v":"-"},null,null,9,null,{"$f":"IFERROR(VLOOKUP(J55,Entries!$A:$E,5,0),\"-\")","v":"-"},{"$f":"IFERROR(VLOOKUP(J55,Entries!$A:$D,4,0),\"-\")","v":"-"},{"$f":"IFERROR(VLOOKUP(J55,Entries!$A:$H,8,0),\"-\")","v":"-"},{"$f":"IFERROR(VLOOKUP(J55,Entries!$A:$F,6,0),\"-\")","v":"-"}]
[10,null,{"$f":"IFERROR(VLOOKUP(B56,Entries!$A:$E,5,0),\"-\")","v":"-"},{"$f":"IFERROR(VLOOKUP(B56,Entries!$A:$D,4,0),\"-\")","v":"-"},{"$f":"IFERROR(VLOOKUP(B56,Entries!$A:$H,8,0),\"-\")","v":"-"},{"$f":"IFERROR(VLOOKUP(B56,Entries!$A:$F,6,0),\"-\")","v":"-"},null,null,10,null,{"$f":"IFERROR(VLOOKUP(J56,Entries!$A:$E,5,0),\"-\")","v":"-"},{"$f":"IFERROR(VLOOKUP(J56,Entries!$A:$D,4,0),\"-\")","v":"-"},{"$f":"IFERROR(VLOOKUP(J56,Entries!$A:$H,8,0),\"-\")","v":"-"},{"$f":"IFERROR(VLOOKUP(J56,Entries!$A:$F,6,0),\"-\")","v":"-"}]
[]
[]
["Senior Men",null,null,null,null,null,null,null,"Veteran Women"]
["Pos","Number","Last Name","First Name","Age","Club","Time",null,"Pos","Number","Last Name","First Name","Age","Club","Time"]
[1,284,{"$f":"IFERROR(VLOOKUP(B61,Entries!$A:$E,5,0),\"-\")","v":"Swindell"},{"$f":"IFERROR(VLOOKUP(B61,Entries!$A:$D,4,0),\"-\")","v":"Ellis"},{"$f":"IFERROR(VLOOKUP(B61,Entries!$A:$H,8,0),\"-\")","v":23},{"$f":"IFERROR(VLOOKUP(B61,Entries!$A:$F,6,0),\"-\")","v":"Benfleet RC"},"2.05.1",null,1,345,{"$f":"IFERROR(VLOOKUP(J61,Entries!$A:$E,5,0),\"-\")","v":"Donnelly"},{"$f":"IFERROR(VLOOKUP(J61,Entries!$A:$D,4,0),\"-\")","v":"Linda"},{"$f":"IFERROR(VLOOKUP(J61,Entries!$A:$H,8,0),\"-\")","v":66},{"$f":"IFERROR(VLOOKUP(J61,Entries!$A:$F,6,0),\"-\")","v":"City of Southend On Sea AC"},"3.58.85"]
[2,null,{"$f":"IFERROR(VLOOKUP(B62,Entries!$A:$E,5,0),\"-\")","v":"-"},{"$f":"IFERROR(VLOOKUP(B62,Entries!$A:$D,4,0),\"-\")","v":"-"},{"$f":"IFERROR(VLOOKUP(B62,Entries!$A:$H,8,0),\"-\")","v":"-"},{"$f":"IFERROR(VLOOKUP(B62,Entries!$A:$F,6,0),\"-\")","v":"-"},null,null,2,null,{"$f":"IFERROR(VLOOKUP(J62,Entries!$A:$E,5,0),\"-\")","v":"-"},{"$f":"IFERROR(VLOOKUP(J62,Entries!$A:$D,4,0),\"-\")","v":"-"},{"$f":"IFERROR(VLOOKUP(J62,Entries!$A:$H,8,0),\"-\")","v":"-"},{"$f":"IFERROR(VLOOKUP(J62,Entries!$A:$F,6,0),\"-\")","v":"-"}]
[3,null,{"$f":"IFERROR(VLOOKUP(B63,Entries!$A:$E,5,0),\"-\")","v":"-"},{"$f":"IFERROR(VLOOKUP(B63,Entries!$A:$D,4,0),\"-\")","v":"-"},{"$f":"IFERROR(VLOOKUP(B63,Entries!$A:$H,8,0),\"-\")","v":"-"},{"$f":"IFERROR(VLOOKUP(B63,Entries!$A:$F,6,0),\"-\")","v":"-"},null,null,3,null,{"$f":"IFERROR(VLOOKUP(J63,Entries!$A:$E,5,0),\"-\")","v":"-"},{"$f":"IFERROR(VLOOKUP(J63,Entries!$A:$D,4,0),\"-\")","v":"-"},{"$f":"IFERROR(VLOOKUP(J63,Entries!$A:$H,8,0),\"-\")","v":"-"},{"$f":"IFERROR(VLOOKUP(J63,Entries!$A:$F,6,0),\"-\")","v":"-"}]
[4,null,{"$f":"IFERROR(VLOOKUP(B64,Entries!$A:$E,5,0),\"-\")","v":"-"},{"$f":"IFERROR(VLOOKUP(B64,Entries!$A:$D,4,0),\"-\")","v":"-"},{"$f":"IFERROR(VLOOKUP(B64,Entries!$A:$H,8,0),\"-\")","v":"-"},{"$f":"IFERROR(VLOOKUP(B64,Entries!$A:$F,6,0),\"-\")","v":"-"},null,null,4,null,{"$f":"IFERROR(VLOOKUP(J64,Entries!$A:$E,5,0),\"-\")","v":"-"},{"$f":"IFERROR(VLOOKUP(J64,Entries!$A:$D,4,0),\"-\")","v":"-"},{"$f":"IFERROR(VLOOKUP(J64,Entries!$A:$H,8,0),\"-\")","v":"-"},{"$f":"IFERROR(VLOOKUP(J64,Entries!$A:$F,6,0),\"-\")","v":"-"}]
[5,null,{"$f":"IFERROR(VLOOKUP(B65,Entries!$A:$E,5,0),\"-\")","v":"-"},{"$f":"IFERROR(VLOOKUP(B65,Entries!$A:$D,4,0),\"-\")","v":"-"},{"$f":"IFERROR(VLOOKUP(B65,Entries!$A:$H,8,0),\"-\")","v":"-"},{"$f":"IFERROR(VLOOKUP(B65,Entries!$A:$F,6,0),\"-\")","v":"-"},null,null,5,null,{"$f":"IFERROR(VLOOKUP(J65,Entries!$A:$E,5,0),\"-\")","v":"-"},{"$f":"IFERROR(VLOOKUP(J65,Entries!$A:$D,4,0),\"-\")","v":"-"},{"$f":"IFERROR(VLOOKUP(J65,Entries!$A:$H,8,0),\"-\")","v":"-"},{"$f":"IFERROR(VLOOKUP(J65,Entries!$A:$F,6,0),\"-\")","v":"-"}]
[6,null,{"$f":"IFERROR(VLOOKUP(B66,Entries!$A:$E,5,0),\"-\")","v":"-"},{"$f":"IFERROR(VLOOKUP(B66,Entries!$A:$D,4,0),\"-\")","v":"-"},{"$f":"IFERROR(VLOOKUP(B66,Entries!$A:$H,8,0),\"-\")","v":"-"},{"$f":"IFERROR(VLOOKUP(B66,Entries!$A:$F,6,0),\"-\")","v":"-"},null,null,6,null,{"$f":"IFERROR(VLOOKUP(J66,Entries!$A:$E,5,0),\"-\")","v":"-"},{"$f":"IFERROR(VLOOKUP(J66,Entries!$A:$D,4,0),\"-\")","v":"-"},{"$f":"IFERROR(VLOOKUP(J66,Entries!$A:$H,8,0),\"-\")","v":"-"},{"$f":"IFERROR(VLOOKUP(J66,Entries!$A:$F,6,0),\"-\")","v":"-"}]
[7,null,{"$f":"IFERROR(VLOOKUP(B67,Entries!$A:$E,5,0),\"-\")","v":"-"},{"$f":"IFERROR(VLOOKUP(B67,Entries!$A:$D,4,0),\"-\")","v":"-"},{"$f":"IFERROR(VLOOKUP(B67,Entries!$A:$H,8,0),\"-\")","v":"-"},{"$f":"IFERROR(VLOOKUP(B67,Entries!$A:$F,6,0),\"-\")","v":"-"},null,null,7,null,{"$f":"IFERROR(VLOOKUP(J67,Entries!$A:$E,5,0),\"-\")","v":"-"},{"$f":"IFERROR(VLOOKUP(J67,Entries!$A:$D,4,0),\"-\")","v":"-"},{"$f":"IFERROR(VLOOKUP(J67,Entries!$A:$H,8,0),\"-\")","v":"-"},{"$f":"IFERROR(VLOOKUP(J67,Entries!$A:$F,6,0),\"-\")","v":"-"}]
[8,null,{"$f":"IFERROR(VLOOKUP(B68,Entries!$A:$E,5,0),\"-\")","v":"-"},{"$f":"IFERROR(VLOOKUP(B68,Entries!$A:$D,4,0),\"-\")","v":"-"},{"$f":"IFERROR(VLOOKUP(B68,Entries!$A:$H,8,0),\"-\")","v":"-"},{"$f":"IFERROR(VLOOKUP(B68,Entries!$A:$F,6,0),\"-\")","v":"-"},null,null,8,null,{"$f":"IFERROR(VLOOKUP(J68,Entries!$A:$E,5,0),\"-\")","v":"-"},{"$f":"IFERROR(VLOOKUP(J68,Entries!$A:$D,4,0),\"-\")","v":"-"},{"$f":"IFERROR(VLOOKUP(J68,Entries!$A:$H,8,0),\"-\")","v":"-"},{"$f":"IFERROR(VLOOKUP(J68,Entries!$A:$F,6,0),\"-\")","v":"-"}]
[9,null,{"$f":"IFERROR(VLOOKUP(B69,Entries!$A:$E,5,0),\"-\")","v":"-"},{"$f":"IFERROR(VLOOKUP(B69,Entries!$A:$D,4,0),\"-\")","v":"-"},{"$f":"IFERROR(VLOOKUP(B69,Entries!$A:$H,8,0),\"-\")","v":"-"},{"$f":"IFERROR(VLOOKUP(B69,Entries!$A:$F,6,0),\"-\")","v":"-"},null,null,9,null,{"$f":"IFERROR(VLOOKUP(J69,Entries!$A:$E,5,0),\"-\")","v":"-"},{"$f":"IFERROR(VLOOKUP(J69,Entries!$A:$D,4,0),\"-\")","v":"-"},{"$f":"IFERROR(VLOOKUP(J69,Entries!$A:$H,8,0),\"-\")","v":"-"},{"$f":"IFERROR(VLOOKUP(J69,Entries!$A:$F,6,0),\"-\")","v":"-"}]
[10,null,{"$f":"IFERROR(VLOOKUP(B70,Entries!$A:$E,5,0),\"-\")","v":"-"},{"$f":"IFERROR(VLOOKUP(B70,Entries!$A:$D,4,0),\"-\")","v":"-"},{"$f":"IFERROR(VLOOKUP(B70,Entries!$A:$H,8,0),\"-\")","v":"-"},{"$f":"IFERROR(VLOOKUP(B70,Entries!$A:$F,6,0),\"-\")","v":"-"},null,null,10,null,{"$f":"IFERROR(VLOOKUP(J70,Entries!$A:$E,5,0),\"-\")","v":"-"},{"$f":"IFERROR(VLOOKUP(J70,Entries!$A:$D,4,0),\"-\")","v":"-"},{"$f":"IFERROR(VLOOKUP(J70,Entries!$A:$H,8,0),\"-\")","v":"-"},{"$f":"IFERROR(VLOOKUP(J70,Entries!$A:$F,6,0),\"-\")","v":"-"}]
[]
["Veteran Men"]
["Pos","Number","Last Name","First Name","Age","Club","Time"]
[1,209,{"$f":"IFERROR(VLOOKUP(B74,Entries!$A:$E,5,0),\"-\")","v":"William"},{"$f":"IFERROR(VLOOKUP(B74,Entries!$A:$D,4,0),\"-\")","v":"Bernard"},{"$f":"IFERROR(VLOOKUP(B74,Entries!$A:$H,8,0),\"-\")","v":35},{"$f":"IFERROR(VLOOKUP(B74,Entries!$A:$F,6,0),\"-\")","v":"JBR Run and Tri Club"},"2.52.2"]
[2,376,{"$f":"IFERROR(VLOOKUP(B75,Entries!$A:$E,5,0),\"-\")","v":"Mendoza"},{"$f":"IFERROR(VLOOKUP(B75,Entries!$A:$D,4,0),\"-\")","v":"Nick"},{"$f":"IFERROR(VLOOKUP(B75,Entries!$A:$H,8,0),\"-\")","v":44},{"$f":"IFERROR(VLOOKUP(B75,Entries!$A:$F,6,0),\"-\")","v":"Unattached"},"2.52.7"]
[3,186,{"$f":"IFERROR(VLOOKUP(B76,Entries!$A:$E,5,0),\"-\")","v":"Kendrick"},{"$f":"IFERROR(VLOOKUP(B76,Entries!$A:$D,4,0),\"-\")","v":"Alastair"},{"$f":"IFERROR(VLOOKUP(B76,Entries!$A:$H,8,0),\"-\")","v":71},{"$f":"IFERROR(VLOOKUP(B76,Entries!$A:$F,6,0),\"-\")","v":"Castle Point Joggers"},"3.38.8"]
[4,null,{"$f":"IFERROR(VLOOKUP(B77,Entries!$A:$E,5,0),\"-\")","v":"-"},{"$f":"IFERROR(VLOOKUP(B77,Entries!$A:$D,4,0),\"-\")","v":"-"},{"$f":"IFERROR(VLOOKUP(B77,Entries!$A:$H,8,0),\"-\")","v":"-"},{"$f":"IFERROR(VLOOKUP(B77,Entries!$A:$F,6,0),\"-\")","v":"-"}]
[5,null,{"$f":"IFERROR(VLOOKUP(B78,Entries!$A:$E,5,0),\"-\")","v":"-"},{"$f":"IFERROR(VLOOKUP(B78,Entries!$A:$D,4,0),\"-\")","v":"-"},{"$f":"IFERROR(VLOOKUP(B78,Entries!$A:$H,8,0),\"-\")","v":"-"},{"$f":"IFERROR(VLOOKUP(B78,Entries!$A:$F,6,0),\"-\")","v":"-"}]
[6,null,{"$f":"IFERROR(VLOOKUP(B79,Entries!$A:$E,5,0),\"-\")","v":"-"},{"$f":"IFERROR(VLOOKUP(B79,Entries!$A:$D,4,0),\"-\")","v":"-"},{"$f":"IFERROR(VLOOKUP(B79,Entries!$A:$H,8,0),\"-\")","v":"-"},{"$f":"IFERROR(VLOOKUP(B79,Entries!$A:$F,6,0),\"-\")","v":"-"}]
[7,null,{"$f":"IFERROR(VLOOKUP(B80,Entries!$A:$E,5,0),\"-\")","v":"-"},{"$f":"IFERROR(VLOOKUP(B80,Entries!$A:$D,4,0),\"-\")","v":"-"},{"$f":"IFERROR(VLOOKUP(B80,Entries!$A:$H,8,0),\"-\")","v":"-"},{"$f":"IFERROR(VLOOKUP(B80,Entries!$A:$F,6,0),\"-\")","v":"-"}]
[8,null,{"$f":"IFERROR(VLOOKUP(B81,Entries!$A:$E,5,0),\"-\")","v":"-"},{"$f":"IFERROR(VLOOKUP(B81,Entries!$A:$D,4,0),\"-\")","v":"-"},{"$f":"IFERROR(VLOOKUP(B81,Entries!$A:$H,8,0),\"-\")","v":"-"},{"$f":"IFERROR(VLOOKUP(B81,Entries!$A:$F,6,0),\"-\")","v":"-"}]
[9,null,{"$f":"IFERROR(VLOOKUP(B82,Entries!$A:$E,5,0),\"-\")","v":"-"},{"$f":"IFERROR(VLOOKUP(B82,Entries!$A:$D,4,0),\"-\")","v":"-"},{"$f":"IFERROR(VLOOKUP(B82,Entries!$A:$H,8,0),\"-\")","v":"-"},{"$f":"IFERROR(VLOOKUP(B82,Entries!$A:$F,6,0),\"-\")","v":"-"}]
[10,null,{"$f":"IFERROR(VLOOKUP(B83,Entries!$A:$E,5,0),\"-\")","v":"-"},{"$f":"IFERROR(VLOOKUP(B83,Entries!$A:$D,4,0),\"-\")","v":"-"},{"$f":"IFERROR(VLOOKUP(B83,Entries!$A:$H,8,0),\"-\")","v":"-"},{"$f":"IFERROR(VLOOKUP(B83,Entries!$A:$F,6,0),\"-\")","v":"-"}]

{"sheet":"1500m","index":13,"n_rows":71,"n_cols":15,"rows_kept":71,"cut":false,"hidden":false,"merged":[]}
["1500m"]
[]
["U13 Boys",null,null,null,null,null,null,null,"U13 Girls"]
["Pos","Number","Last Name","First Name","Age","Club","Time",null,"Pos","Number","Last Name","First Name","Age","Club","Time"]
[1,115,{"$f":"IFERROR(VLOOKUP(B5,Entries!$A:$E,5,0),\"-\")","v":"Smith"},{"$f":"IFERROR(VLOOKUP(B5,Entries!$A:$D,4,0),\"-\")","v":"Charlie"},{"$f":"IFERROR(VLOOKUP(B5,Entries!$A:$H,8,0),\"-\")","v":12},{"$f":"IFERROR(VLOOKUP(B5,Entries!$A:$F,6,0),\"-\")","v":"SS Athletics"},"5.03.93",null,1,51,{"$f":"IFERROR(VLOOKUP(J5,Entries!$A:$E,5,0),\"-\")","v":"Owen"},{"$f":"IFERROR(VLOOKUP(J5,Entries!$A:$D,4,0),\"-\")","v":"Sadie"},{"$f":"IFERROR(VLOOKUP(J5,Entries!$A:$H,8,0),\"-\")","v":12},{"$f":"IFERROR(VLOOKUP(J5,Entries!$A:$F,6,0),\"-\")","v":"SS Athletics"},"5.21.74"]
[2,98,{"$f":"IFERROR(VLOOKUP(B6,Entries!$A:$E,5,0),\"-\")","v":"Lupton"},{"$f":"IFERROR(VLOOKUP(B6,Entries!$A:$D,4,0),\"-\")","v":"Oliver"},{"$f":"IFERROR(VLOOKUP(B6,Entries!$A:$H,8,0),\"-\")","v":11},{"$f":"IFERROR(VLOOKUP(B6,Entries!$A:$F,6,0),\"-\")","v":"SS Athletics"},"5.04.33",null,2,175,{"$f":"IFERROR(VLOOKUP(J6,Entries!$A:$E,5,0),\"-\")","v":"Sabado"},{"$f":"IFERROR(VLOOKUP(J6,Entries!$A:$D,4,0),\"-\")","v":"Aria"},{"$f":"IFERROR(VLOOKUP(J6,Entries!$A:$H,8,0),\"-\")","v":12},{"$f":"IFERROR(VLOOKUP(J6,Entries!$A:$F,6,0),\"-\")","v":"Brentwood Beagles Athletics Club"},"5.35.42"]
[3,114,{"$f":"IFERROR(VLOOKUP(B7,Entries!$A:$E,5,0),\"-\")","v":"Lee"},{"$f":"IFERROR(VLOOKUP(B7,Entries!$A:$D,4,0),\"-\")","v":"Charlie"},{"$f":"IFERROR(VLOOKUP(B7,Entries!$A:$H,8,0),\"-\")","v":12},{"$f":"IFERROR(VLOOKUP(B7,Entries!$A:$F,6,0),\"-\")","v":"SS Athletics"},"5.04.43",null,3,41,{"$f":"IFERROR(VLOOKUP(J7,Entries!$A:$E,5,0),\"-\")","v":"Burrows"},{"$f":"IFERROR(VLOOKUP(J7,Entries!$A:$D,4,0),\"-\")","v":"Fleur"},{"$f":"IFERROR(VLOOKUP(J7,Entries!$A:$H,8,0),\"-\")","v":11},{"$f":"IFERROR(VLOOKUP(J7,Entries!$A:$F,6,0),\"-\")","v":"SS Athletics"},"5.37.79"]
[4,97,{"$f":"IFERROR(VLOOKUP(B8,Entries!$A:$E,5,0),\"-\")","v":"Wing"},{"$f":"IFERROR(VLOOKUP(B8,Entries!$A:$D,4,0),\"-\")","v":"Harry"},{"$f":"IFERROR(VLOOKUP(B8,Entries!$A:$H,8,0),\"-\")","v":12},{"$f":"IFERROR(VLOOKUP(B8,Entries!$A:$F,6,0),\"-\")","v":"Basildon AC"},"5.04.79",null,4,101,{"$f":"IFERROR(VLOOKUP(J8,Entries!$A:$E,5,0),\"-\")","v":"Hallahan"},{"$f":"IFERROR(VLOOKUP(J8,Entries!$A:$D,4,0),\"-\")","v":"Ivy-Rose"},{"$f":"IFERROR(VLOOKUP(J8,Entries!$A:$H,8,0),\"-\")","v":11},{"$f":"IFERROR(VLOOKUP(J8,Entries!$A:$F,6,0),\"-\")","v":"Colchester & Tendring AC"},"5.58.00"]
[5,291,{"$f":"IFERROR(VLOOKUP(B9,Entries!$A:$E,5,0),\"-\")","v":"Smith"},{"$f":"IFERROR(VLOOKUP(B9,Entries!$A:$D,4,0),\"-\")","v":"George"},{"$f":"IFERROR(VLOOKUP(B9,Entries!$A:$H,8,0),\"-\")","v":11},{"$f":"IFERROR(VLOOKUP(B9,Entries!$A:$F,6,0),\"-\")","v":"Brentwood Beagles Athletics Club"},"5.47.16",null,5,26,{"$f":"IFERROR(VLOOKUP(J9,Entries!$A:$E,5,0),\"-\")","v":"Rolfe"},{"$f":"IFERROR(VLOOKUP(J9,Entries!$A:$D,4,0),\"-\")","v":"Poppy"},{"$f":"IFERROR(VLOOKUP(J9,Entries!$A:$H,8,0),\"-\")","v":12},{"$f":"IFERROR(VLOOKUP(J9,Entries!$A:$F,6,0),\"-\")","v":"SS Athletics"},"6.30.65"]
[6,378,{"$f":"IFERROR(VLOOKUP(B10,Entries!$A:$E,5,0),\"-\")","v":"Bilby"},{"$f":"IFERROR(VLOOKUP(B10,Entries!$A:$D,4,0),\"-\")","v":"James"},{"$f":"IFERROR(VLOOKUP(B10,Entries!$A:$H,8,0),\"-\")","v":12},{"$f":"IFERROR(VLOOKUP(B10,Entries!$A:$F,6,0),\"-\")","v":"Unattached"},"5.51.16",null,6,null,{"$f":"IFERROR(VLOOKUP(J10,Entries!$A:$E,5,0),\"-\")","v":"-"},{"$f":"IFERROR(VLOOKUP(J10,Entries!$A:$D,4,0),\"-\")","v":"-"},{"$f":"IFERROR(VLOOKUP(J10,Entries!$A:$H,8,0),\"-\")","v":"-"},{"$f":"IFERROR(VLOOKUP(J10,Entries!$A:$F,6,0),\"-\")","v":"-"}]
[7,269,{"$f":"IFERROR(VLOOKUP(B11,Entries!$A:$E,5,0),\"-\")","v":"Frisby-Bright"},{"$f":"IFERROR(VLOOKUP(B11,Entries!$A:$D,4,0),\"-\")","v":"Ethan"},{"$f":"IFERROR(VLOOKUP(B11,Entries!$A:$H,8,0),\"-\")","v":11},{"$f":"IFERROR(VLOOKUP(B11,Entries!$A:$F,6,0),\"-\")","v":"Haverhill Running Club"},"5.54.75",null,7,null,{"$f":"IFERROR(VLOOKUP(J11,Entries!$A:$E,5,0),\"-\")","v":"-"},{"$f":"IFERROR(VLOOKUP(J11,Entries!$A:$D,4,0),\"-\")","v":"-"},{"$f":"IFERROR(VLOOKUP(J11,Entries!$A:$H,8,0),\"-\")","v":"-"},{"$f":"IFERROR(VLOOKUP(J11,Entries!$A:$F,6,0),\"-\")","v":"-"}]
[8,370,{"$f":"IFERROR(VLOOKUP(B12,Entries!$A:$E,5,0),\"-\")","v":"Partridge"},{"$f":"IFERROR(VLOOKUP(B12,Entries!$A:$D,4,0),\"-\")","v":"Mason"},{"$f":"IFERROR(VLOOKUP(B12,Entries!$A:$H,8,0),\"-\")","v":11},{"$f":"IFERROR(VLOOKUP(B12,Entries!$A:$F,6,0),\"-\")","v":"Colchester & Tendring AC"},"6.28.62",null,8,null,{"$f":"IFERROR(VLOOKUP(J12,Entries!$A:$E,5,0),\"-\")","v":"-"},{"$f":"IFERROR(VLOOKUP(J12,Entries!$A:$D,4,0),\"-\")","v":"-"},{"$f":"IFERROR(VLOOKUP(J12,Entries!$A:$H,8,0),\"-\")","v":"-"},{"$f":"IFERROR(VLOOKUP(J12,Entries!$A:$F,6,0),\"-\")","v":"-"}]
[9,132,{"$f":"IFERROR(VLOOKUP(B13,Entries!$A:$E,5,0),\"-\")","v":"Fox"},{"$f":"IFERROR(VLOOKUP(B13,Entries!$A:$D,4,0),\"-\")","v":"Ketan"},{"$f":"IFERROR(VLOOKUP(B13,Entries!$A:$H,8,0),\"-\")","v":11},{"$f":"IFERROR(VLOOKUP(B13,Entries!$A:$F,6,0),\"-\")","v":"Unattached"},"6.34.48",null,9,null,{"$f":"IFERROR(VLOOKUP(J13,Entries!$A:$E,5,0),\"-\")","v":"-"},{"$f":"IFERROR(VLOOKUP(J13,Entries!$A:$D,4,0),\"-\")","v":"-"},{"$f":"IFERROR(VLOOKUP(J13,Entries!$A:$H,8,0),\"-\")","v":"-"},{"$f":"IFERROR(VLOOKUP(J13,Entries!$A:$F,6,0),\"-\")","v":"-"}]
[10,null,{"$f":"IFERROR(VLOOKUP(B14,Entries!$A:$E,5,0),\"-\")","v":"-"},{"$f":"IFERROR(VLOOKUP(B14,Entries!$A:$D,4,0),\"-\")","v":"-"},{"$f":"IFERROR(VLOOKUP(B14,Entries!$A:$H,8,0),\"-\")","v":"-"},{"$f":"IFERROR(VLOOKUP(B14,Entries!$A:$F,6,0),\"-\")","v":"-"},null,null,10,null,{"$f":"IFERROR(VLOOKUP(J14,Entries!$A:$E,5,0),\"-\")","v":"-"},{"$f":"IFERROR(VLOOKUP(J14,Entries!$A:$D,4,0),\"-\")","v":"-"},{"$f":"IFERROR(VLOOKUP(J14,Entries!$A:$H,8,0),\"-\")","v":"-"},{"$f":"IFERROR(VLOOKUP(J14,Entries!$A:$F,6,0),\"-\")","v":"-"}]
[11,null,{"$f":"IFERROR(VLOOKUP(B15,Entries!$A:$E,5,0),\"-\")","v":"-"},{"$f":"IFERROR(VLOOKUP(B15,Entries!$A:$D,4,0),\"-\")","v":"-"},{"$f":"IFERROR(VLOOKUP(B15,Entries!$A:$H,8,0),\"-\")","v":"-"},{"$f":"IFERROR(VLOOKUP(B15,Entries!$A:$F,6,0),\"-\")","v":"-"}]
[12,null,{"$f":"IFERROR(VLOOKUP(B16,Entries!$A:$E,5,0),\"-\")","v":"-"},{"$f":"IFERROR(VLOOKUP(B16,Entries!$A:$D,4,0),\"-\")","v":"-"},{"$f":"IFERROR(VLOOKUP(B16,Entries!$A:$H,8,0),\"-\")","v":"-"},{"$f":"IFERROR(VLOOKUP(B16,Entries!$A:$F,6,0),\"-\")","v":"-"}]
[]
[]
["U15 Boys",null,null,null,null,null,null,null,"U15 Girls"]
["Pos","Number","Last Name","First Name","Age","Club","Time",null,"Pos","Number","Last Name","First Name","Age","Club","Time"]
[1,35,{"$f":"IFERROR(VLOOKUP(B21,Entries!$A:$E,5,0),\"-\")","v":"Delea"},{"$f":"IFERROR(VLOOKUP(B21,Entries!$A:$D,4,0),\"-\")","v":"Matthew"},{"$f":"IFERROR(VLOOKUP(B21,Entries!$A:$H,8,0),\"-\")","v":14},{"$f":"IFERROR(VLOOKUP(B21,Entries!$A:$F,6,0),\"-\")","v":"Brentwood Beagles Athletics Club"},"4.31.37",null,1,240,{"$f":"IFERROR(VLOOKUP(J21,Entries!$A:$E,5,0),\"-\")","v":"Eida"},{"$f":"IFERROR(VLOOKUP(J21,Entries!$A:$D,4,0),\"-\")","v":"Izzy"},{"$f":"IFERROR(VLOOKUP(J21,Entries!$A:$H,8,0),\"-\")","v":13},{"$f":"IFERROR(VLOOKUP(J21,Entries!$A:$F,6,0),\"-\")","v":"Chelmsford AC"},"4.59.17"]
[2,208,{"$f":"IFERROR(VLOOKUP(B22,Entries!$A:$E,5,0),\"-\")","v":"Hearn"},{"$f":"IFERROR(VLOOKUP(B22,Entries!$A:$D,4,0),\"-\")","v":"Jude"},{"$f":"IFERROR(VLOOKUP(B22,Entries!$A:$H,8,0),\"-\")","v":14},{"$f":"IFERROR(VLOOKUP(B22,Entries!$A:$F,6,0),\"-\")","v":"Brentwood Beagles Athletics Club"},"4.40.66",null,2,311,{"$f":"IFERROR(VLOOKUP(J22,Entries!$A:$E,5,0),\"-\")","v":"Standring"},{"$f":"IFERROR(VLOOKUP(J22,Entries!$A:$D,4,0),\"-\")","v":"Ella"},{"$f":"IFERROR(VLOOKUP(J22,Entries!$A:$H,8,0),\"-\")","v":13},{"$f":"IFERROR(VLOOKUP(J22,Entries!$A:$F,6,0),\"-\")","v":"Ipswich Harriers"},"5.16.02"]
[3,260,{"$f":"IFERROR(VLOOKUP(B23,Entries!$A:$E,5,0),\"-\")","v":"Wright"},{"$f":"IFERROR(VLOOKUP(B23,Entries!$A:$D,4,0),\"-\")","v":"Jack"},{"$f":"IFERROR(VLOOKUP(B23,Entries!$A:$H,8,0),\"-\")","v":13},{"$f":"IFERROR(VLOOKUP(B23,Entries!$A:$F,6,0),\"-\")","v":"Herts Phoenix AC"},"4.58.69",null,3,350,{"$f":"IFERROR(VLOOKUP(J23,Entries!$A:$E,5,0),\"-\")","v":"Forrest"},{"$f":"IFERROR(VLOOKUP(J23,Entries!$A:$D,4,0),\"-\")","v":"Isabel"},{"$f":"IFERROR(VLOOKUP(J23,Entries!$A:$H,8,0),\"-\")","v":14},{"$f":"IFERROR(VLOOKUP(J23,Entries!$A:$F,6,0),\"-\")","v":"Brentwood Beagles Athletics Club"},"5.21.71"]
[4,261,{"$f":"IFERROR(VLOOKUP(B24,Entries!$A:$E,5,0),\"-\")","v":"Wright"},{"$f":"IFERROR(VLOOKUP(B24,Entries!$A:$D,4,0),\"-\")","v":"Lewis"},{"$f":"IFERROR(VLOOKUP(B24,Entries!$A:$H,8,0),\"-\")","v":13},{"$f":"IFERROR(VLOOKUP(B24,Entries!$A:$F,6,0),\"-\")","v":"Herts Phoenix AC"},"5.10.55",null,4,270,{"$f":"IFERROR(VLOOKUP(J24,Entries!$A:$E,5,0),\"-\")","v":"Bowd"},{"$f":"IFERROR(VLOOKUP(J24,Entries!$A:$D,4,0),\"-\")","v":"Orla"},{"$f":"IFERROR(VLOOKUP(J24,Entries!$A:$H,8,0),\"-\")","v":13},{"$f":"IFERROR(VLOOKUP(J24,Entries!$A:$F,6,0),\"-\")","v":"Unattached"},"5.25.94"]
[5,34,{"$f":"IFERROR(VLOOKUP(B25,Entries!$A:$E,5,0),\"-\")","v":"Edwards"},{"$f":"IFERROR(VLOOKUP(B25,Entries!$A:$D,4,0),\"-\")","v":"Frankie"},{"$f":"IFERROR(VLOOKUP(B25,Entries!$A:$H,8,0),\"-\")","v":13},{"$f":"IFERROR(VLOOKUP(B25,Entries!$A:$F,6,0),\"-\")","v":"Brentwood Beagles Athletics Club"},"5.27.67",null,5,308,{"$f":"IFERROR(VLOOKUP(J25,Entries!$A:$E,5,0),\"-\")","v":"Nix"},{"$f":"IFERROR(VLOOKUP(J25,Entries!$A:$D,4,0),\"-\")","v":"Keira"},{"$f":"IFERROR(VLOOKUP(J25,Entries!$A:$H,8,0),\"-\")","v":13},{"$f":"IFERROR(VLOOKUP(J25,Entries!$A:$F,6,0),\"-\")","v":"Basildon AC"},"5.34.33"]
[6,182,{"$f":"IFERROR(VLOOKUP(B26,Entries!$A:$E,5,0),\"-\")","v":"Anderson"},{"$f":"IFERROR(VLOOKUP(B26,Entries!$A:$D,4,0),\"-\")","v":"Thomas"},{"$f":"IFERROR(VLOOKUP(B26,Entries!$A:$H,8,0),\"-\")","v":14},{"$f":"IFERROR(VLOOKUP(B26,Entries!$A:$F,6,0),\"-\")","v":"Herts Phoenix AC"},"5.31.15",null,6,275,{"$f":"IFERROR(VLOOKUP(J26,Entries!$A:$E,5,0),\"-\")","v":"Licence"},{"$f":"IFERROR(VLOOKUP(J26,Entries!$A:$D,4,0),\"-\")","v":"Ella"},{"$f":"IFERROR(VLOOKUP(J26,Entries!$A:$H,8,0),\"-\")","v":14},{"$f":"IFERROR(VLOOKUP(J26,Entries!$A:$F,6,0),\"-\")","v":"Colchester Harriers AC"},"5.44.90"]
[7,null,{"$f":"IFERROR(VLOOKUP(B27,Entries!$A:$E,5,0),\"-\")","v":"-"},{"$f":"IFERROR(VLOOKUP(B27,Entries!$A:$D,4,0),\"-\")","v":"-"},{"$f":"IFERROR(VLOOKUP(B27,Entries!$A:$H,8,0),\"-\")","v":"-"},{"$f":"IFERROR(VLOOKUP(B27,Entries!$A:$F,6,0),\"-\")","v":"-"},null,null,7,null,{"$f":"IFERROR(VLOOKUP(J27,Entries!$A:$E,5,0),\"-\")","v":"-"},{"$f":"IFERROR(VLOOKUP(J27,Entries!$A:$D,4,0),\"-\")","v":"-"},{"$f":"IFERROR(VLOOKUP(J27,Entries!$A:$H,8,0),\"-\")","v":"-"},{"$f":"IFERROR(VLOOKUP(J27,Entries!$A:$F,6,0),\"-\")","v":"-"}]
[8,null,{"$f":"IFERROR(VLOOKUP(B28,Entries!$A:$E,5,0),\"-\")","v":"-"},{"$f":"IFERROR(VLOOKUP(B28,Entries!$A:$D,4,0),\"-\")","v":"-"},{"$f":"IFERROR(VLOOKUP(B28,Entries!$A:$H,8,0),\"-\")","v":"-"},{"$f":"IFERROR(VLOOKUP(B28,Entries!$A:$F,6,0),\"-\")","v":"-"},null,null,8,null,{"$f":"IFERROR(VLOOKUP(J28,Entries!$A:$E,5,0),\"-\")","v":"-"},{"$f":"IFERROR(VLOOKUP(J28,Entries!$A:$D,4,0),\"-\")","v":"-"},{"$f":"IFERROR(VLOOKUP(J28,Entries!$A:$H,8,0),\"-\")","v":"-"},{"$f":"IFERROR(VLOOKUP(J28,Entries!$A:$F,6,0),\"-\")","v":"-"}]
[9,null,{"$f":"IFERROR(VLOOKUP(B29,Entries!$A:$E,5,0),\"-\")","v":"-"},{"$f":"IFERROR(VLOOKUP(B29,Entries!$A:$D,4,0),\"-\")","v":"-"},{"$f":"IFERROR(VLOOKUP(B29,Entries!$A:$H,8,0),\"-\")","v":"-"},{"$f":"IFERROR(VLOOKUP(B29,Entries!$A:$F,6,0),\"-\")","v":"-"},null,null,9,null,{"$f":"IFERROR(VLOOKUP(J29,Entries!$A:$E,5,0),\"-\")","v":"-"},{"$f":"IFERROR(VLOOKUP(J29,Entries!$A:$D,4,0),\"-\")","v":"-"},{"$f":"IFERROR(VLOOKUP(J29,Entries!$A:$H,8,0),\"-\")","v":"-"},{"$f":"IFERROR(VLOOKUP(J29,Entries!$A:$F,6,0),\"-\")","v":"-"}]
[10,null,{"$f":"IFERROR(VLOOKUP(B30,Entries!$A:$E,5,0),\"-\")","v":"-"},{"$f":"IFERROR(VLOOKUP(B30,Entries!$A:$D,4,0),\"-\")","v":"-"},{"$f":"IFERROR(VLOOKUP(B30,Entries!$A:$H,8,0),\"-\")","v":"-"},{"$f":"IFERROR(VLOOKUP(B30,Entries!$A:$F,6,0),\"-\")","v":"-"},null,null,10,null,{"$f":"IFERROR(VLOOKUP(J30,Entries!$A:$E,5,0),\"-\")","v":"-"},{"$f":"IFERROR(VLOOKUP(J30,Entries!$A:$D,4,0),\"-\")","v":"-"},{"$f":"IFERROR(VLOOKUP(J30,Entries!$A:$H,8,0),\"-\")","v":"-"},{"$f":"IFERROR(VLOOKUP(J30,Entries!$A:$F,6,0),\"-\")","v":"-"}]
[]
[]
["U17 Men",null,null,null,null,null,null,null,"U17 Women"]
["Pos","Number","Last Name","First Name","Age","Club","Time",null,"Pos","Number","Last Name","First Name","Age","Club","Time"]
[1,318,{"$f":"IFERROR(VLOOKUP(B35,Entries!$A:$E,5,0),\"-\")","v":"Peck"},{"$f":"IFERROR(VLOOKUP(B35,Entries!$A:$D,4,0),\"-\")","v":"Connor"},{"$f":"IFERROR(VLOOKUP(B35,Entries!$A:$H,8,0),\"-\")","v":16},{"$f":"IFERROR(VLOOKUP(B35,Entries!$A:$F,6,0),\"-\")","v":"Ipswich Jaffa RC"},"4.16.44",null,1,285,{"$f":"IFERROR(VLOOKUP(J35,Entries!$A:$E,5,0),\"-\")","v":"Heaton"},{"$f":"IFERROR(VLOOKUP(J35,Entries!$A:$D,4,0),\"-\")","v":"Tilly"},{"$f":"IFERROR(VLOOKUP(J35,Entries!$A:$H,8,0),\"-\")","v":15},{"$f":"IFERROR(VLOOKUP(J35,Entries!$A:$F,6,0),\"-\")","v":"Castle Point Joggers"},"6.10.94"]
[2,125,{"$f":"IFERROR(VLOOKUP(B36,Entries!$A:$E,5,0),\"-\")","v":"Evison"},{"$f":"IFERROR(VLOOKUP(B36,Entries!$A:$D,4,0),\"-\")","v":"Finlay"},{"$f":"IFERROR(VLOOKUP(B36,Entries!$A:$H,8,0),\"-\")","v":16},{"$f":"IFERROR(VLOOKUP(B36,Entries!$A:$F,6,0),\"-\")","v":"Basildon AC"},"4.19.96",null,2,null,{"$f":"IFERROR(VLOOKUP(J36,Entries!$A:$E,5,0),\"-\")","v":"-"},{"$f":"IFERROR(VLOOKUP(J36,Entries!$A:$D,4,0),\"-\")","v":"-"},{"$f":"IFERROR(VLOOKUP(J36,Entries!$A:$H,8,0),\"-\")","v":"-"},{"$f":"IFERROR(VLOOKUP(J36,Entries!$A:$F,6,0),\"-\")","v":"-"}]
[3,176,{"$f":"IFERROR(VLOOKUP(B37,Entries!$A:$E,5,0),\"-\")","v":"Carter"},{"$f":"IFERROR(VLOOKUP(B37,Entries!$A:$D,4,0),\"-\")","v":"Thomas"},{"$f":"IFERROR(VLOOKUP(B37,Entries!$A:$H,8,0),\"-\")","v":15},{"$f":"IFERROR(VLOOKUP(B37,Entries!$A:$F,6,0),\"-\")","v":"Chelmsford AC"},"4.24.70",null,3,null,{"$f":"IFERROR(VLOOKUP(J37,Entries!$A:$E,5,0),\"-\")","v":"-"},{"$f":"IFERROR(VLOOKUP(J37,Entries!$A:$D,4,0),\"-\")","v":"-"},{"$f":"IFERROR(VLOOKUP(J37,Entries!$A:$H,8,0),\"-\")","v":"-"},{"$f":"IFERROR(VLOOKUP(J37,Entries!$A:$F,6,0),\"-\")","v":"-"}]
[4,239,{"$f":"IFERROR(VLOOKUP(B38,Entries!$A:$E,5,0),\"-\")","v":"Eida"},{"$f":"IFERROR(VLOOKUP(B38,Entries!$A:$D,4,0),\"-\")","v":"Joshua"},{"$f":"IFERROR(VLOOKUP(B38,Entries!$A:$H,8,0),\"-\")","v":15},{"$f":"IFERROR(VLOOKUP(B38,Entries!$A:$F,6,0),\"-\")","v":"Chelmsford AC"},"4.25.03",null,4,null,{"$f":"IFERROR(VLOOKUP(J38,Entries!$A:$E,5,0),\"-\")","v":"-"},{"$f":"IFERROR(VLOOKUP(J38,Entries!$A:$D,4,0),\"-\")","v":"-"},{"$f":"IFERROR(VLOOKUP(J38,Entries!$A:$H,8,0),\"-\")","v":"-"},{"$f":"IFERROR(VLOOKUP(J38,Entries!$A:$F,6,0),\"-\")","v":"-"}]
[5,106,{"$f":"IFERROR(VLOOKUP(B39,Entries!$A:$E,5,0),\"-\")","v":"Silvain"},{"$f":"IFERROR(VLOOKUP(B39,Entries!$A:$D,4,0),\"-\")","v":"Bradley"},{"$f":"IFERROR(VLOOKUP(B39,Entries!$A:$H,8,0),\"-\")","v":16},{"$f":"IFERROR(VLOOKUP(B39,Entries!$A:$F,6,0),\"-\")","v":"Basildon AC"},"4.40.66",null,"Senior Women"]
[6,107,{"$f":"IFERROR(VLOOKUP(B40,Entries!$A:$E,5,0),\"-\")","v":"Silvain"},{"$f":"IFERROR(VLOOKUP(B40,Entries!$A:$D,4,0),\"-\")","v":"Hayden"},{"$f":"IFERROR(VLOOKUP(B40,Entries!$A:$H,8,0),\"-\")","v":15},{"$f":"IFERROR(VLOOKUP(B40,Entries!$A:$F,6,0),\"-\")","v":"Basildon AC"},"4.49.13",null,"Pos","Number","Last Name","First Name","Age","Club","Time"]
[7,null,{"$f":"IFERROR(VLOOKUP(B41,Entries!$A:$E,5,0),\"-\")","v":"-"},{"$f":"IFERROR(VLOOKUP(B41,Entries!$A:$D,4,0),\"-\")","v":"-"},{"$f":"IFERROR(VLOOKUP(B41,Entries!$A:$H,8,0),\"-\")","v":"-"},{"$f":"IFERROR(VLOOKUP(B41,Entries!$A:$F,6,0),\"-\")","v":"-"},null,null,1,231,{"$f":"IFERROR(VLOOKUP(J41,Entries!$A:$E,5,0),\"-\")","v":"Hopper"},{"$f":"IFERROR(VLOOKUP(J41,Entries!$A:$D,4,0),\"-\")","v":"Laura"},{"$f":"IFERROR(VLOOKUP(J41,Entries!$A:$H,8,0),\"-\")","v":23},{"$f":"IFERROR(VLOOKUP(J41,Entries!$A:$F,6,0),\"-\")","v":"London City Runners"},"5.45.80"]
[8,null,{"$f":"IFERROR(VLOOKUP(B42,Entries!$A:$E,5,0),\"-\")","v":"-"},{"$f":"IFERROR(VLOOKUP(B42,Entries!$A:$D,4,0),\"-\")","v":"-"},{"$f":"IFERROR(VLOOKUP(B42,Entries!$A:$H,8,0),\"-\")","v":"-"},{"$f":"IFERROR(VLOOKUP(B42,Entries!$A:$F,6,0),\"-\")","v":"-"},null,null,2,null,{"$f":"IFERROR(VLOOKUP(J42,Entries!$A:$E,5,0),\"-\")","v":"-"},{"$f":"IFERROR(VLOOKUP(J42,Entries!$A:$D,4,0),\"-\")","v":"-"},{"$f":"IFERROR(VLOOKUP(J42,Entries!$A:$H,8,0),\"-\")","v":"-"},{"$f":"IFERROR(VLOOKUP(J42,Entries!$A:$F,6,0),\"-\")","v":"-"}]
[9,null,{"$f":"IFERROR(VLOOKUP(B43,Entries!$A:$E,5,0),\"-\")","v":"-"},{"$f":"IFERROR(VLOOKUP(B43,Entries!$A:$D,4,0),\"-\")","v":"-"},{"$f":"IFERROR(VLOOKUP(B43,Entries!$A:$H,8,0),\"-\")","v":"-"},{"$f":"IFERROR(VLOOKUP(B43,Entries!$A:$F,6,0),\"-\")","v":"-"},null,null,3,null,{"$f":"IFERROR(VLOOKUP(J43,Entries!$A:$E,5,0),\"-\")","v":"-"},{"$f":"IFERROR(VLOOKUP(J43,Entries!$A:$D,4,0),\"-\")","v":"-"},{"$f":"IFERROR(VLOOKUP(J43,Entries!$A:$H,8,0),\"-\")","v":"-"},{"$f":"IFERROR(VLOOKUP(J43,Entries!$A:$F,6,0),\"-\")","v":"-"}]
[10,null,{"$f":"IFERROR(VLOOKUP(B44,Entries!$A:$E,5,0),\"-\")","v":"-"},{"$f":"IFERROR(VLOOKUP(B44,Entries!$A:$D,4,0),\"-\")","v":"-"},{"$f":"IFERROR(VLOOKUP(B44,Entries!$A:$H,8,0),\"-\")","v":"-"},{"$f":"IFERROR(VLOOKUP(B44,Entries!$A:$F,6,0),\"-\")","v":"-"},null,null,4,null,{"$f":"IFERROR(VLOOKUP(J44,Entries!$A:$E,5,0),\"-\")","v":"-"},{"$f":"IFERROR(VLOOKUP(J44,Entries!$A:$D,4,0),\"-\")","v":"-"},{"$f":"IFERROR(VLOOKUP(J44,Entries!$A:$H,8,0),\"-\")","v":"-"},{"$f":"IFERROR(VLOOKUP(J44,Entries!$A:$F,6,0),\"-\")","v":"-"}]
[]
[]
["Senior Men"]
["Pos","Number","Last Name","First Name","Age","Club","Time",null,"Veteran Women"]
[1,244,{"$f":"IFERROR(VLOOKUP(B49,Entries!$A:$E,5,0),\"-\")","v":"O'Hara"},{"$f":"IFERROR(VLOOKUP(B49,Entries!$A:$D,4,0),\"-\")","v":"Kieran"},{"$f":"IFERROR(VLOOKUP(B49,Entries!$A:$H,8,0),\"-\")","v":25},{"$f":"IFERROR(VLOOKUP(B49,Entries!$A:$F,6,0),\"-\")","v":"Havering AC"},"4.11.60",null,"Pos","Number","Last Name","First Name","Age","Club","Time"]
[2,284,{"$f":"IFERROR(VLOOKUP(B50,Entries!$A:$E,5,0),\"-\")","v":"Swindell"},{"$f":"IFERROR(VLOOKUP(B50,Entries!$A:$D,4,0),\"-\")","v":"Ellis"},{"$f":"IFERROR(VLOOKUP(B50,Entries!$A:$H,8,0),\"-\")","v":23},{"$f":"IFERROR(VLOOKUP(B50,Entries!$A:$F,6,0),\"-\")","v":"Benfleet RC"},"4.13.69",null,1,349,{"$f":"IFERROR(VLOOKUP(J50,Entries!$A:$E,5,0),\"-\")","v":"Shewbridge"},{"$f":"IFERROR(VLOOKUP(J50,Entries!$A:$D,4,0),\"-\")","v":"Laura"},{"$f":"IFERROR(VLOOKUP(J50,Entries!$A:$H,8,0),\"-\")","v":42},{"$f":"IFERROR(VLOOKUP(J50,Entries!$A:$F,6,0),\"-\")","v":"Unattached"},"5.34.37"]
[3,297,{"$f":"IFERROR(VLOOKUP(B51,Entries!$A:$E,5,0),\"-\")","v":"Stewart"},{"$f":"IFERROR(VLOOKUP(B51,Entries!$A:$D,4,0),\"-\")","v":"James"},{"$f":"IFERROR(VLOOKUP(B51,Entries!$A:$H,8,0),\"-\")","v":25},{"$f":"IFERROR(VLOOKUP(B51,Entries!$A:$F,6,0),\"-\")","v":"Havering AC"},"4.14.68",null,2,82,{"$f":"IFERROR(VLOOKUP(J51,Entries!$A:$E,5,0),\"-\")","v":"Bolter"},{"$f":"IFERROR(VLOOKUP(J51,Entries!$A:$D,4,0),\"-\")","v":"Joanne"},{"$f":"IFERROR(VLOOKUP(J51,Entries!$A:$H,8,0),\"-\")","v":51},{"$f":"IFERROR(VLOOKUP(J51,Entries!$A:$F,6,0),\"-\")","v":"Leigh-on-Sea Striders"},"5.48.58"]
[4,29,{"$f":"IFERROR(VLOOKUP(B52,Entries!$A:$E,5,0),\"-\")","v":"Zahir"},{"$f":"IFERROR(VLOOKUP(B52,Entries!$A:$D,4,0),\"-\")","v":"Hamza"},{"$f":"IFERROR(VLOOKUP(B52,Entries!$A:$H,8,0),\"-\")","v":27},{"$f":"IFERROR(VLOOKUP(B52,Entries!$A:$F,6,0),\"-\")","v":"Rochford Running Club"},"4.35.60",null,3,382,{"$f":"IFERROR(VLOOKUP(J52,Entries!$A:$E,5,0),\"-\")","v":"Dodge"},{"$f":"IFERROR(VLOOKUP(J52,Entries!$A:$D,4,0),\"-\")","v":"Amanda"},{"$f":"IFERROR(VLOOKUP(J52,Entries!$A:$H,8,0),\"-\")","v":41},{"$f":"IFERROR(VLOOKUP(J52,Entries!$A:$F,6,0),\"-\")","v":"JBR Run & Tri"},"7.12.35"]
[5,null,{"$f":"IFERROR(VLOOKUP(B53,Entries!$A:$E,5,0),\"-\")","v":"-"},{"$f":"IFERROR(VLOOKUP(B53,Entries!$A:$D,4,0),\"-\")","v":"-"},{"$f":"IFERROR(VLOOKUP(B53,Entries!$A:$H,8,0),\"-\")","v":"-"},{"$f":"IFERROR(VLOOKUP(B53,Entries!$A:$F,6,0),\"-\")","v":"-"},null,null,4,345,{"$f":"IFERROR(VLOOKUP(J53,Entries!$A:$E,5,0),\"-\")","v":"Donnelly"},{"$f":"IFERROR(VLOOKUP(J53,Entries!$A:$D,4,0),\"-\")","v":"Linda"},{"$f":"IFERROR(VLOOKUP(J53,Entries!$A:$H,8,0),\"-\")","v":66},{"$f":"IFERROR(VLOOKUP(J53,Entries!$A:$F,6,0),\"-\")","v":"City of Southend On Sea AC"},"8.12.62"]
[6,null,{"$f":"IFERROR(VLOOKUP(B54,Entries!$A:$E,5,0),\"-\")","v":"-"},{"$f":"IFERROR(VLOOKUP(B54,Entries!$A:$D,4,0),\"-\")","v":"-"},{"$f":"IFERROR(VLOOKUP(B54,Entries!$A:$H,8,0),\"-\")","v":"-"},{"$f":"IFERROR(VLOOKUP(B54,Entries!$A:$F,6,0),\"-\")","v":"-"},null,null,5,null,"-","-","-","-"]
[7,null,{"$f":"IFERROR(VLOOKUP(B55,Entries!$A:$E,5,0),\"-\")","v":"-"},{"$f":"IFERROR(VLOOKUP(B55,Entries!$A:$D,4,0),\"-\")","v":"-"},{"$f":"IFERROR(VLOOKUP(B55,Entries!$A:$H,8,0),\"-\")","v":"-"},{"$f":"IFERROR(VLOOKUP(B55,Entries!$A:$F,6,0),\"-\")","v":"-"},null,null,6,null,"-","-","-","-"]
[8,null,{"$f":"IFERROR(VLOOKUP(B56,Entries!$A:$E,5,0),\"-\")","v":"-"},{"$f":"IFERROR(VLOOKUP(B56,Entries!$A:$D,4,0),\"-\")","v":"-"},{"$f":"IFERROR(VLOOKUP(B56,Entries!$A:$H,8,0),\"-\")","v":"-"},{"$f":"IFERROR(VLOOKUP(B56,Entries!$A:$F,6,0),\"-\")","v":"-"},null,null,7,null,"-","-","-","-"]
[9,null,{"$f":"IFERROR(VLOOKUP(B57,Entries!$A:$E,5,0),\"-\")","v":"-"},{"$f":"IFERROR(VLOOKUP(B57,Entries!$A:$D,4,0),\"-\")","v":"-"},{"$f":"IFERROR(VLOOKUP(B57,Entries!$A:$H,8,0),\"-\")","v":"-"},{"$f":"IFERROR(VLOOKUP(B57,Entries!$A:$F,6,0),\"-\")","v":"-"},null,null,8,null,"-","-","-","-"]
[10,null,{"$f":"IFERROR(VLOOKUP(B58,Entries!$A:$E,5,0),\"-\")","v":"-"},{"$f":"IFERROR(VLOOKUP(B58,Entries!$A:$D,4,0),\"-\")","v":"-"},{"$f":"IFERROR(VLOOKUP(B58,Entries!$A:$H,8,0),\"-\")","v":"-"},{"$f":"IFERROR(VLOOKUP(B58,Entries!$A:$F,6,0),\"-\")","v":"-"},null,null,9,null,"-","-","-","-"]
[null,null,null,null,null,null,null,null,10,null,"-","-","-","-"]
["Veteran Men"]
["Pos","Number","Last Name","First Name","Age","Club","Time"]
[1,105,{"$f":"IFERROR(VLOOKUP(B62,Entries!$A:$E,5,0),\"-\")","v":"Townsend"},{"$f":"IFERROR(VLOOKUP(B62,Entries!$A:$D,4,0),\"-\")","v":"Jason"},{"$f":"IFERROR(VLOOKUP(B62,Entries!$A:$H,8,0),\"-\")","v":47},{"$f":"IFERROR(VLOOKUP(B62,Entries!$A:$F,6,0),\"-\")","v":"Colchester & Tendring AC"},"4.49.74"]
[2,140,{"$f":"IFERROR(VLOOKUP(B63,Entries!$A:$E,5,0),\"-\")","v":"Spooner"},{"$f":"IFERROR(VLOOKUP(B63,Entries!$A:$D,4,0),\"-\")","v":"Terence"},{"$f":"IFERROR(VLOOKUP(B63,Entries!$A:$H,8,0),\"-\")","v":52},{"$f":"IFERROR(VLOOKUP(B63,Entries!$A:$F,6,0),\"-\")","v":"Castle Point Joggers"},"5.03.07"]
[3,186,{"$f":"IFERROR(VLOOKUP(B64,Entries!$A:$E,5,0),\"-\")","v":"Kendrick"},{"$f":"IFERROR(VLOOKUP(B64,Entries!$A:$D,4,0),\"-\")","v":"Alastair"},{"$f":"IFERROR(VLOOKUP(B64,Entries!$A:$H,8,0),\"-\")","v":71},{"$f":"IFERROR(VLOOKUP(B64,Entries!$A:$F,6,0),\"-\")","v":"Castle Point Joggers"},"7.15.56"]
[4,null,{"$f":"IFERROR(VLOOKUP(B65,Entries!$A:$E,5,0),\"-\")","v":"-"},{"$f":"IFERROR(VLOOKUP(B65,Entries!$A:$D,4,0),\"-\")","v":"-"},{"$f":"IFERROR(VLOOKUP(B65,Entries!$A:$H,8,0),\"-\")","v":"-"},{"$f":"IFERROR(VLOOKUP(B65,Entries!$A:$F,6,0),\"-\")","v":"-"}]
[5,null,"-","-","-","-"]
[6,null,"-","-","-","-"]
[7,null,"-","-","-","-"]
[8,null,"-","-","-","-"]
[9,null,"-","-","-","-"]
[10,null,"-","-","-","-"]

{"sheet":"High Jump","index":14,"n_rows":61,"n_cols":17,"rows_kept":61,"cut":false,"hidden":false,"merged":[]}
["High Jump"]
[]
[]
[]
["U13 Boys",null,null,null,null,null,null,null,null,"U13 Girls"]
["Pos","Number","Last Name","First Name","Age","Club","Distance","Wind",null,"Pos","Number","Last Name","First Name","Age","Club","Distance","Wind"]
[1,52,{"$f":"IFERROR(VLOOKUP(B7,Entries!$A:$E,5,0),\"-\")","v":"Stone"},{"$f":"IFERROR(VLOOKUP(B7,Entries!$A:$D,4,0),\"-\")","v":"Bradley"},{"$f":"IFERROR(VLOOKUP(B7,Entries!$A:$H,8,0),\"-\")","v":12},{"$f":"IFERROR(VLOOKUP(B7,Entries!$A:$F,6,0),\"-\")","v":"Hillingdon AC"},"1.55",null,null,1,11,{"$f":"IFERROR(VLOOKUP(K7,Entries!$A:$E,5,0),\"-\")","v":"Frisby"},{"$f":"IFERROR(VLOOKUP(K7,Entries!$A:$D,4,0),\"-\")","v":"Emma"},{"$f":"IFERROR(VLOOKUP(K7,Entries!$A:$H,8,0),\"-\")","v":12},{"$f":"IFERROR(VLOOKUP(K7,Entries!$A:$F,6,0),\"-\")","v":"City of Southend On Sea AC"},"1.55"]
[2,118,{"$f":"IFERROR(VLOOKUP(B8,Entries!$A:$E,5,0),\"-\")","v":"Petherbridge"},{"$f":"IFERROR(VLOOKUP(B8,Entries!$A:$D,4,0),\"-\")","v":"Finn"},{"$f":"IFERROR(VLOOKUP(B8,Entries!$A:$H,8,0),\"-\")","v":12},{"$f":"IFERROR(VLOOKUP(B8,Entries!$A:$F,6,0),\"-\")","v":"SS Athletics"},"1.50",null,null,2,100,{"$f":"IFERROR(VLOOKUP(K8,Entries!$A:$E,5,0),\"-\")","v":"Scragg"},{"$f":"IFERROR(VLOOKUP(K8,Entries!$A:$D,4,0),\"-\")","v":"Abigail"},{"$f":"IFERROR(VLOOKUP(K8,Entries!$A:$H,8,0),\"-\")","v":12},{"$f":"IFERROR(VLOOKUP(K8,Entries!$A:$F,6,0),\"-\")","v":"Camberley & District AC"},"1.35"]
[3,362,{"$f":"IFERROR(VLOOKUP(B9,Entries!$A:$E,5,0),\"-\")","v":"Sumner"},{"$f":"IFERROR(VLOOKUP(B9,Entries!$A:$D,4,0),\"-\")","v":"Henry"},{"$f":"IFERROR(VLOOKUP(B9,Entries!$A:$H,8,0),\"-\")","v":12},{"$f":"IFERROR(VLOOKUP(B9,Entries!$A:$F,6,0),\"-\")","v":"SS Athletics"},"1.45",null,null,3,217,{"$f":"IFERROR(VLOOKUP(K9,Entries!$A:$E,5,0),\"-\")","v":"Richards"},{"$f":"IFERROR(VLOOKUP(K9,Entries!$A:$D,4,0),\"-\")","v":"Lucy"},{"$f":"IFERROR(VLOOKUP(K9,Entries!$A:$H,8,0),\"-\")","v":12},{"$f":"IFERROR(VLOOKUP(K9,Entries!$A:$F,6,0),\"-\")","v":"Watford Harriers"},"1.30"]
[4,157,{"$f":"IFERROR(VLOOKUP(B10,Entries!$A:$E,5,0),\"-\")","v":"Tricker"},{"$f":"IFERROR(VLOOKUP(B10,Entries!$A:$D,4,0),\"-\")","v":"Aiden"},{"$f":"IFERROR(VLOOKUP(B10,Entries!$A:$H,8,0),\"-\")","v":12},{"$f":"IFERROR(VLOOKUP(B10,Entries!$A:$F,6,0),\"-\")","v":"SS Athletics"},"1.45",null,null,4,101,{"$f":"IFERROR(VLOOKUP(K10,Entries!$A:$E,5,0),\"-\")","v":"Hallahan"},{"$f":"IFERROR(VLOOKUP(K10,Entries!$A:$D,4,0),\"-\")","v":"Ivy-Rose"},{"$f":"IFERROR(VLOOKUP(K10,Entries!$A:$H,8,0),\"-\")","v":11},{"$f":"IFERROR(VLOOKUP(K10,Entries!$A:$F,6,0),\"-\")","v":"Colchester & Tendring AC"},"1.10"]
["5=",86,{"$f":"IFERROR(VLOOKUP(B11,Entries!$A:$E,5,0),\"-\")","v":"Short"},{"$f":"IFERROR(VLOOKUP(B11,Entries!$A:$D,4,0),\"-\")","v":"William"},{"$f":"IFERROR(VLOOKUP(B11,Entries!$A:$H,8,0),\"-\")","v":12},{"$f":"IFERROR(VLOOKUP(B11,Entries!$A:$F,6,0),\"-\")","v":"SS Athletics"},"1.40",null,null,5,266,{"$f":"IFERROR(VLOOKUP(K11,Entries!$A:$E,5,0),\"-\")","v":"Tubman"},{"$f":"IFERROR(VLOOKUP(K11,Entries!$A:$D,4,0),\"-\")","v":"Ciara"},{"$f":"IFERROR(VLOOKUP(K11,Entries!$A:$H,8,0),\"-\")","v":11},{"$f":"IFERROR(VLOOKUP(K11,Entries!$A:$F,6,0),\"-\")","v":"City of Southend On Sea AC"},"1.05"]
["5=",369,{"$f":"IFERROR(VLOOKUP(B12,Entries!$A:$E,5,0),\"-\")","v":"Cordell"},{"$f":"IFERROR(VLOOKUP(B12,Entries!$A:$D,4,0),\"-\")","v":"Dylan"},{"$f":"IFERROR(VLOOKUP(B12,Entries!$A:$H,8,0),\"-\")","v":12},{"$f":"IFERROR(VLOOKUP(B12,Entries!$A:$F,6,0),\"-\")","v":"SS Athletics"},"1.40",null,null,6,null,{"$f":"IFERROR(VLOOKUP(K12,Entries!$A:$E,5,0),\"-\")","v":"-"},{"$f":"IFERROR(VLOOKUP(K12,Entries!$A:$D,4,0),\"-\")","v":"-"},{"$f":"IFERROR(VLOOKUP(K12,Entries!$A:$H,8,0),\"-\")","v":"-"},{"$f":"IFERROR(VLOOKUP(K12,Entries!$A:$F,6,0),\"-\")","v":"-"}]
[7,370,{"$f":"IFERROR(VLOOKUP(B13,Entries!$A:$E,5,0),\"-\")","v":"Partridge"},{"$f":"IFERROR(VLOOKUP(B13,Entries!$A:$D,4,0),\"-\")","v":"Mason"},{"$f":"IFERROR(VLOOKUP(B13,Entries!$A:$H,8,0),\"-\")","v":11},{"$f":"IFERROR(VLOOKUP(B13,Entries!$A:$F,6,0),\"-\")","v":"Colchester & Tendring AC"},"1.25",null,null,7,null,{"$f":"IFERROR(VLOOKUP(K13,Entries!$A:$E,5,0),\"-\")","v":"-"},{"$f":"IFERROR(VLOOKUP(K13,Entries!$A:$D,4,0),\"-\")","v":"-"},{"$f":"IFERROR(VLOOKUP(K13,Entries!$A:$H,8,0),\"-\")","v":"-"},{"$f":"IFERROR(VLOOKUP(K13,Entries!$A:$F,6,0),\"-\")","v":"-"}]
["8=",8,{"$f":"IFERROR(VLOOKUP(B14,Entries!$A:$E,5,0),\"-\")","v":"Armour"},{"$f":"IFERROR(VLOOKUP(B14,Entries!$A:$D,4,0),\"-\")","v":"Adam"},{"$f":"IFERROR(VLOOKUP(B14,Entries!$A:$H,8,0),\"-\")","v":12},{"$f":"IFERROR(VLOOKUP(B14,Entries!$A:$F,6,0),\"-\")","v":"Brentwood Beagles Athletics Club"},"1.15",null,null,8,null,{"$f":"IFERROR(VLOOKUP(K14,Entries!$A:$E,5,0),\"-\")","v":"-"},{"$f":"IFERROR(VLOOKUP(K14,Entries!$A:$D,4,0),\"-\")","v":"-"},{"$f":"IFERROR(VLOOKUP(K14,Entries!$A:$H,8,0),\"-\")","v":"-"},{"$f":"IFERROR(VLOOKUP(K14,Entries!$A:$F,6,0),\"-\")","v":"-"}]
["8=",248,{"$f":"IFERROR(VLOOKUP(B15,Entries!$A:$E,5,0),\"-\")","v":"Rumsby"},{"$f":"IFERROR(VLOOKUP(B15,Entries!$A:$D,4,0),\"-\")","v":"Noah"},{"$f":"IFERROR(VLOOKUP(B15,Entries!$A:$H,8,0),\"-\")","v":11},{"$f":"IFERROR(VLOOKUP(B15,Entries!$A:$F,6,0),\"-\")","v":"SS Athletics"},"1.15",null,null,9,null,{"$f":"IFERROR(VLOOKUP(K15,Entries!$A:$E,5,0),\"-\")","v":"-"},{"$f":"IFERROR(VLOOKUP(K15,Entries!$A:$D,4,0),\"-\")","v":"-"},{"$f":"IFERROR(VLOOKUP(K15,Entries!$A:$H,8,0),\"-\")","v":"-"},{"$f":"IFERROR(VLOOKUP(K15,Entries!$A:$F,6,0),\"-\")","v":"-"}]
[null,null,{"$f":"IFERROR(VLOOKUP(B16,Entries!$A:$E,5,0),\"-\")","v":"-"},{"$f":"IFERROR(VLOOKUP(B16,Entries!$A:$D,4,0),\"-\")","v":"-"},{"$f":"IFERROR(VLOOKUP(B16,Entries!$A:$H,8,0),\"-\")","v":"-"},{"$f":"IFERROR(VLOOKUP(B16,Entries!$A:$F,6,0),\"-\")","v":"-"},null,null,null,10,null,{"$f":"IFERROR(VLOOKUP(K16,Entries!$A:$E,5,0),\"-\")","v":"-"},{"$f":"IFERROR(VLOOKUP(K16,Entries!$A:$D,4,0),\"-\")","v":"-"},{"$f":"IFERROR(VLOOKUP(K16,Entries!$A:$H,8,0),\"-\")","v":"-"},{"$f":"IFERROR(VLOOKUP(K16,Entries!$A:$F,6,0),\"-\")","v":"-"}]
[]
[]
["U15 Boys",null,null,null,null,null,null,null,null,"U15 Girls"]
["Pos","Number","Last Name","First Name","Age","Club","Distance","Wind",null,"Pos","Number","Last Name","First Name","Age","Club","Distance","Wind"]
[1,61,{"$f":"IFERROR(VLOOKUP(B21,Entries!$A:$E,5,0),\"-\")","v":"Read"},{"$f":"IFERROR(VLOOKUP(B21,Entries!$A:$D,4,0),\"-\")","v":"Jake"},{"$f":"IFERROR(VLOOKUP(B21,Entries!$A:$H,8,0),\"-\")","v":13},{"$f":"IFERROR(VLOOKUP(B21,Entries!$A:$F,6,0),\"-\")","v":"Chelmsford AC"},"1.70",null,null,1,196,{"$f":"IFERROR(VLOOKUP(K21,Entries!$A:$E,5,0),\"-\")","v":"Archer"},{"$f":"IFERROR(VLOOKUP(K21,Entries!$A:$D,4,0),\"-\")","v":"Emily"},{"$f":"IFERROR(VLOOKUP(K21,Entries!$A:$H,8,0),\"-\")","v":14},{"$f":"IFERROR(VLOOKUP(K21,Entries!$A:$F,6,0),\"-\")","v":"City of Southend On Sea AC"},"1.60"]
[2,92,{"$f":"IFERROR(VLOOKUP(B22,Entries!$A:$E,5,0),\"-\")","v":"Dunn"},{"$f":"IFERROR(VLOOKUP(B22,Entries!$A:$D,4,0),\"-\")","v":"Larry"},{"$f":"IFERROR(VLOOKUP(B22,Entries!$A:$H,8,0),\"-\")","v":13},{"$f":"IFERROR(VLOOKUP(B22,Entries!$A:$F,6,0),\"-\")","v":"SS Athletics"},"1.65",null,null,2,207,{"$f":"IFERROR(VLOOKUP(K22,Entries!$A:$E,5,0),\"-\")","v":"McGowan"},{"$f":"IFERROR(VLOOKUP(K22,Entries!$A:$D,4,0),\"-\")","v":"Freya "},{"$f":"IFERROR(VLOOKUP(K22,Entries!$A:$H,8,0),\"-\")","v":13},{"$f":"IFERROR(VLOOKUP(K22,Entries!$A:$F,6,0),\"-\")","v":"Watford Harriers"},"1.50"]
[3,null,{"$f":"IFERROR(VLOOKUP(B23,Entries!$A:$E,5,0),\"-\")","v":"-"},{"$f":"IFERROR(VLOOKUP(B23,Entries!$A:$D,4,0),\"-\")","v":"-"},{"$f":"IFERROR(VLOOKUP(B23,Entries!$A:$H,8,0),\"-\")","v":"-"},{"$f":"IFERROR(VLOOKUP(B23,Entries!$A:$F,6,0),\"-\")","v":"-"},null,null,null,3,293,{"$f":"IFERROR(VLOOKUP(K23,Entries!$A:$E,5,0),\"-\")","v":"May"},{"$f":"IFERROR(VLOOKUP(K23,Entries!$A:$D,4,0),\"-\")","v":"Martha"},{"$f":"IFERROR(VLOOKUP(K23,Entries!$A:$H,8,0),\"-\")","v":14},{"$f":"IFERROR(VLOOKUP(K23,Entries!$A:$F,6,0),\"-\")","v":"Braintree & District AC"},"1.45"]
[4,null,{"$f":"IFERROR(VLOOKUP(B24,Entries!$A:$E,5,0),\"-\")","v":"-"},{"$f":"IFERROR(VLOOKUP(B24,Entries!$A:$D,4,0),\"-\")","v":"-"},{"$f":"IFERROR(VLOOKUP(B24,Entries!$A:$H,8,0),\"-\")","v":"-"},{"$f":"IFERROR(VLOOKUP(B24,Entries!$A:$F,6,0),\"-\")","v":"-"},null,null,null,4,354,{"$f":"IFERROR(VLOOKUP(K24,Entries!$A:$E,5,0),\"-\")","v":"Bailey"},{"$f":"IFERROR(VLOOKUP(K24,Entries!$A:$D,4,0),\"-\")","v":"Ava"},{"$f":"IFERROR(VLOOKUP(K24,Entries!$A:$H,8,0),\"-\")","v":14},{"$f":"IFERROR(VLOOKUP(K24,Entries!$A:$F,6,0),\"-\")","v":"Basildon AC"},"1.40"]
[5,null,{"$f":"IFERROR(VLOOKUP(B25,Entries!$A:$E,5,0),\"-\")","v":"-"},{"$f":"IFERROR(VLOOKUP(B25,Entries!$A:$D,4,0),\"-\")","v":"-"},{"$f":"IFERROR(VLOOKUP(B25,Entries!$A:$H,8,0),\"-\")","v":"-"},{"$f":"IFERROR(VLOOKUP(B25,Entries!$A:$F,6,0),\"-\")","v":"-"},null,null,null,5,230,{"$f":"IFERROR(VLOOKUP(K25,Entries!$A:$E,5,0),\"-\")","v":"Hartman"},{"$f":"IFERROR(VLOOKUP(K25,Entries!$A:$D,4,0),\"-\")","v":"Lily"},{"$f":"IFERROR(VLOOKUP(K25,Entries!$A:$H,8,0),\"-\")","v":14},{"$f":"IFERROR(VLOOKUP(K25,Entries!$A:$F,6,0),\"-\")","v":"Basildon AC"},"1.40"]
[6,null,{"$f":"IFERROR(VLOOKUP(B26,Entries!$A:$E,5,0),\"-\")","v":"-"},{"$f":"IFERROR(VLOOKUP(B26,Entries!$A:$D,4,0),\"-\")","v":"-"},{"$f":"IFERROR(VLOOKUP(B26,Entries!$A:$H,8,0),\"-\")","v":"-"},{"$f":"IFERROR(VLOOKUP(B26,Entries!$A:$F,6,0),\"-\")","v":"-"},null,null,null,6,73,{"$f":"IFERROR(VLOOKUP(K26,Entries!$A:$E,5,0),\"-\")","v":"Sladden"},{"$f":"IFERROR(VLOOKUP(K26,Entries!$A:$D,4,0),\"-\")","v":"Dakota"},{"$f":"IFERROR(VLOOKUP(K26,Entries!$A:$H,8,0),\"-\")","v":14},{"$f":"IFERROR(VLOOKUP(K26,Entries!$A:$F,6,0),\"-\")","v":"SS Athletics"},"1.35"]
[7,null,{"$f":"IFERROR(VLOOKUP(B27,Entries!$A:$E,5,0),\"-\")","v":"-"},{"$f":"IFERROR(VLOOKUP(B27,Entries!$A:$D,4,0),\"-\")","v":"-"},{"$f":"IFERROR(VLOOKUP(B27,Entries!$A:$H,8,0),\"-\")","v":"-"},{"$f":"IFERROR(VLOOKUP(B27,Entries!$A:$F,6,0),\"-\")","v":"-"},null,null,null,7,54,{"$f":"IFERROR(VLOOKUP(K27,Entries!$A:$E,5,0),\"-\")","v":"Rushworth"},{"$f":"IFERROR(VLOOKUP(K27,Entries!$A:$D,4,0),\"-\")","v":"Annalise"},{"$f":"IFERROR(VLOOKUP(K27,Entries!$A:$H,8,0),\"-\")","v":13},{"$f":"IFERROR(VLOOKUP(K27,Entries!$A:$F,6,0),\"-\")","v":"Windsor Slough Eton & Hounslow AC"},"1.25"]
[8,null,{"$f":"IFERROR(VLOOKUP(B28,Entries!$A:$E,5,0),\"-\")","v":"-"},{"$f":"IFERROR(VLOOKUP(B28,Entries!$A:$D,4,0),\"-\")","v":"-"},{"$f":"IFERROR(VLOOKUP(B28,Entries!$A:$H,8,0),\"-\")","v":"-"},{"$f":"IFERROR(VLOOKUP(B28,Entries!$A:$F,6,0),\"-\")","v":"-"},null,null,null,8,null,{"$f":"IFERROR(VLOOKUP(K28,Entries!$A:$E,5,0),\"-\")","v":"-"},{"$f":"IFERROR(VLOOKUP(K28,Entries!$A:$D,4,0),\"-\")","v":"-"},{"$f":"IFERROR(VLOOKUP(K28,Entries!$A:$H,8,0),\"-\")","v":"-"},{"$f":"IFERROR(VLOOKUP(K28,Entries!$A:$F,6,0),\"-\")","v":"-"}]
[9,null,{"$f":"IFERROR(VLOOKUP(B29,Entries!$A:$E,5,0),\"-\")","v":"-"},{"$f":"IFERROR(VLOOKUP(B29,Entries!$A:$D,4,0),\"-\")","v":"-"},{"$f":"IFERROR(VLOOKUP(B29,Entries!$A:$H,8,0),\"-\")","v":"-"},{"$f":"IFERROR(VLOOKUP(B29,Entries!$A:$F,6,0),\"-\")","v":"-"},null,null,null,9,null,{"$f":"IFERROR(VLOOKUP(K29,Entries!$A:$E,5,0),\"-\")","v":"-"},{"$f":"IFERROR(VLOOKUP(K29,Entries!$A:$D,4,0),\"-\")","v":"-"},{"$f":"IFERROR(VLOOKUP(K29,Entries!$A:$H,8,0),\"-\")","v":"-"},{"$f":"IFERROR(VLOOKUP(K29,Entries!$A:$F,6,0),\"-\")","v":"-"}]
[10,null,{"$f":"IFERROR(VLOOKUP(B30,Entries!$A:$E,5,0),\"-\")","v":"-"},{"$f":"IFERROR(VLOOKUP(B30,Entries!$A:$D,4,0),\"-\")","v":"-"},{"$f":"IFERROR(VLOOKUP(B30,Entries!$A:$H,8,0),\"-\")","v":"-"},{"$f":"IFERROR(VLOOKUP(B30,Entries!$A:$F,6,0),\"-\")","v":"-"},null,null,null,10,null,{"$f":"IFERROR(VLOOKUP(K30,Entries!$A:$E,5,0),\"-\")","v":"-"},{"$f":"IFERROR(VLOOKUP(K30,Entries!$A:$D,4,0),\"-\")","v":"-"},{"$f":"IFERROR(VLOOKUP(K30,Entries!$A:$H,8,0),\"-\")","v":"-"},{"$f":"IFERROR(VLOOKUP(K30,Entries!$A:$F,6,0),\"-\")","v":"-"}]
[]
[]
[]
[null,null,null,null,null,null,null,null,null,"U20 Women"]
[null,null,null,null,null,null,null,null,null,"Pos","Number","Last Name","First Name","Age","Club","Distance","Wind"]
[null,null,null,null,null,null,null,null,null,1,96,{"$f":"IFERROR(VLOOKUP(K36,Entries!$A:$E,5,0),\"-\")","v":"Olivier"},{"$f":"IFERROR(VLOOKUP(K36,Entries!$A:$D,4,0),\"-\")","v":"Ena"},{"$f":"IFERROR(VLOOKUP(K36,Entries!$A:$H,8,0),\"-\")","v":18},{"$f":"IFERROR(VLOOKUP(K36,Entries!$A:$F,6,0),\"-\")","v":"Herts Phoenix AC"},"1.65"]
[null,null,null,null,null,null,null,null,null,2,null,{"$f":"IFERROR(VLOOKUP(K37,Entries!$A:$E,5,0),\"-\")","v":"-"},{"$f":"IFERROR(VLOOKUP(K37,Entries!$A:$D,4,0),\"-\")","v":"-"},{"$f":"IFERROR(VLOOKUP(K37,Entries!$A:$H,8,0),\"-\")","v":"-"},{"$f":"IFERROR(VLOOKUP(K37,Entries!$A:$F,6,0),\"-\")","v":"-"}]
[null,null,null,null,null,null,null,null,null,3,null,{"$f":"IFERROR(VLOOKUP(K38,Entries!$A:$E,5,0),\"-\")","v":"-"},{"$f":"IFERROR(VLOOKUP(K38,Entries!$A:$D,4,0),\"-\")","v":"-"},{"$f":"IFERROR(VLOOKUP(K38,Entries!$A:$H,8,0),\"-\")","v":"-"},{"$f":"IFERROR(VLOOKUP(K38,Entries!$A:$F,6,0),\"-\")","v":"-"}]
[null,null,null,null,null,null,null,null,null,4,null,{"$f":"IFERROR(VLOOKUP(K39,Entries!$A:$E,5,0),\"-\")","v":"-"},{"$f":"IFERROR(VLOOKUP(K39,Entries!$A:$D,4,0),\"-\")","v":"-"},{"$f":"IFERROR(VLOOKUP(K39,Entries!$A:$H,8,0),\"-\")","v":"-"},{"$f":"IFERROR(VLOOKUP(K39,Entries!$A:$F,6,0),\"-\")","v":"-"}]
[null,null,null,null,null,null,null,null,null,5,null,{"$f":"IFERROR(VLOOKUP(K40,Entries!$A:$E,5,0),\"-\")","v":"-"},{"$f":"IFERROR(VLOOKUP(K40,Entries!$A:$D,4,0),\"-\")","v":"-"},{"$f":"IFERROR(VLOOKUP(K40,Entries!$A:$H,8,0),\"-\")","v":"-"},{"$f":"IFERROR(VLOOKUP(K40,Entries!$A:$F,6,0),\"-\")","v":"-"}]
[null,null,null,null,null,null,null,null,null,6,null,{"$f":"IFERROR(VLOOKUP(K41,Entries!$A:$E,5,0),\"-\")","v":"-"},{"$f":"IFERROR(VLOOKUP(K41,Entries!$A:$D,4,0),\"-\")","v":"-"},{"$f":"IFERROR(VLOOKUP(K41,Entries!$A:$H,8,0),\"-\")","v":"-"},{"$f":"IFERROR(VLOOKUP(K41,Entries!$A:$F,6,0),\"-\")","v":"-"}]
[null,null,null,null,null,null,null,null,null,7,null,{"$f":"IFERROR(VLOOKUP(K42,Entries!$A:$E,5,0),\"-\")","v":"-"},{"$f":"IFERROR(VLOOKUP(K42,Entries!$A:$D,4,0),\"-\")","v":"-"},{"$f":"IFERROR(VLOOKUP(K42,Entries!$A:$H,8,0),\"-\")","v":"-"},{"$f":"IFERROR(VLOOKUP(K42,Entries!$A:$F,6,0),\"-\")","v":"-"}]
[null,null,null,null,null,null,null,null,null,8,null,{"$f":"IFERROR(VLOOKUP(K43,Entries!$A:$E,5,0),\"-\")","v":"-"},{"$f":"IFERROR(VLOOKUP(K43,Entries!$A:$D,4,0),\"-\")","v":"-"},{"$f":"IFERROR(VLOOKUP(K43,Entries!$A:$H,8,0),\"-\")","v":"-"},{"$f":"IFERROR(VLOOKUP(K43,Entries!$A:$F,6,0),\"-\")","v":"-"}]
[null,null,null,null,null,null,null,null,null,9,null,{"$f":"IFERROR(VLOOKUP(K44,Entries!$A:$E,5,0),\"-\")","v":"-"},{"$f":"IFERROR(VLOOKUP(K44,Entries!$A:$D,4,0),\"-\")","v":"-"},{"$f":"IFERROR(VLOOKUP(K44,Entries!$A:$H,8,0),\"-\")","v":"-"},{"$f":"IFERROR(VLOOKUP(K44,Entries!$A:$F,6,0),\"-\")","v":"-"}]
[null,null,null,null,null,null,null,null,null,10,null,{"$f":"IFERROR(VLOOKUP(K45,Entries!$A:$E,5,0),\"-\")","v":"-"},{"$f":"IFERROR(VLOOKUP(K45,Entries!$A:$D,4,0),\"-\")","v":"-"},{"$f":"IFERROR(VLOOKUP(K45,Entries!$A:$H,8,0),\"-\")","v":"-"},{"$f":"IFERROR(VLOOKUP(K45,Entries!$A:$F,6,0),\"-\")","v":"-"}]
[]
[]
[]
[]
["Veteran Men",null,null,null,null,null,null,null,null,"Veteran Women"]
["Pos","Number","Last Name","First Name","Age","Club","Distance","Wind",null,"Pos","Number","Last Name","First Name","Age","Club","Distance","Wind"]
[1,358,{"$f":"IFERROR(VLOOKUP(B52,Entries!$A:$E,5,0),\"-\")","v":"Goodrem"},{"$f":"IFERROR(VLOOKUP(B52,Entries!$A:$D,4,0),\"-\")","v":"Greg"},{"$f":"IFERROR(VLOOKUP(B52,Entries!$A:$H,8,0),\"-\")","v":40},{"$f":"IFERROR(VLOOKUP(B52,Entries!$A:$F,6,0),\"-\")","v":"City of Southend On Sea AC"},"1.70",null,null,1,345,{"$f":"IFERROR(VLOOKUP(K52,Entries!$A:$E,5,0),\"-\")","v":"Donnelly"},{"$f":"IFERROR(VLOOKUP(K52,Entries!$A:$D,4,0),\"-\")","v":"Linda"},{"$f":"IFERROR(VLOOKUP(K52,Entries!$A:$H,8,0),\"-\")","v":66},{"$f":"IFERROR(VLOOKUP(K52,Entries!$A:$F,6,0),\"-\")","v":"City of Southend On Sea AC"},"1.00"]
[2,210,{"$f":"IFERROR(VLOOKUP(B53,Entries!$A:$E,5,0),\"-\")","v":"Maskell"},{"$f":"IFERROR(VLOOKUP(B53,Entries!$A:$D,4,0),\"-\")","v":"Richard"},{"$f":"IFERROR(VLOOKUP(B53,Entries!$A:$H,8,0),\"-\")","v":48},{"$f":"IFERROR(VLOOKUP(B53,Entries!$A:$F,6,0),\"-\")","v":"City of Southend-on-Sea Athletic Club"},"1.35",null,null,2,null,{"$f":"IFERROR(VLOOKUP(K53,Entries!$A:$E,5,0),\"-\")","v":"-"},{"$f":"IFERROR(VLOOKUP(K53,Entries!$A:$D,4,0),\"-\")","v":"-"},{"$f":"IFERROR(VLOOKUP(K53,Entries!$A:$H,8,0),\"-\")","v":"-"},{"$f":"IFERROR(VLOOKUP(K53,Entries!$A:$F,6,0),\"-\")","v":"-"}]
[3,null,{"$f":"IFERROR(VLOOKUP(B54,Entries!$A:$E,5,0),\"-\")","v":"-"},{"$f":"IFERROR(VLOOKUP(B54,Entries!$A:$D,4,0),\"-\")","v":"-"},{"$f":"IFERROR(VLOOKUP(B54,Entries!$A:$H,8,0),\"-\")","v":"-"},{"$f":"IFERROR(VLOOKUP(B54,Entries!$A:$F,6,0),\"-\")","v":"-"},null,null,null,3,null,{"$f":"IFERROR(VLOOKUP(K54,Entries!$A:$E,5,0),\"-\")","v":"-"},{"$f":"IFERROR(VLOOKUP(K54,Entries!$A:$D,4,0),\"-\")","v":"-"},{"$f":"IFERROR(VLOOKUP(K54,Entries!$A:$H,8,0),\"-\")","v":"-"},{"$f":"IFERROR(VLOOKUP(K54,Entries!$A:$F,6,0),\"-\")","v":"-"}]
[4,null,{"$f":"IFERROR(VLOOKUP(B55,Entries!$A:$E,5,0),\"-\")","v":"-"},{"$f":"IFERROR(VLOOKUP(B55,Entries!$A:$D,4,0),\"-\")","v":"-"},{"$f":"IFERROR(VLOOKUP(B55,Entries!$A:$H,8,0),\"-\")","v":"-"},{"$f":"IFERROR(VLOOKUP(B55,Entries!$A:$F,6,0),\"-\")","v":"-"},null,null,null,4,null,{"$f":"IFERROR(VLOOKUP(K55,Entries!$A:$E,5,0),\"-\")","v":"-"},{"$f":"IFERROR(VLOOKUP(K55,Entries!$A:$D,4,0),\"-\")","v":"-"},{"$f":"IFERROR(VLOOKUP(K55,Entries!$A:$H,8,0),\"-\")","v":"-"},{"$f":"IFERROR(VLOOKUP(K55,Entries!$A:$F,6,0),\"-\")","v":"-"}]
[5,null,{"$f":"IFERROR(VLOOKUP(B56,Entries!$A:$E,5,0),\"-\")","v":"-"},{"$f":"IFERROR(VLOOKUP(B56,Entries!$A:$D,4,0),\"-\")","v":"-"},{"$f":"IFERROR(VLOOKUP(B56,Entries!$A:$H,8,0),\"-\")","v":"-"},{"$f":"IFERROR(VLOOKUP(B56,Entries!$A:$F,6,0),\"-\")","v":"-"},null,null,null,5,null,{"$f":"IFERROR(VLOOKUP(K56,Entries!$A:$E,5,0),\"-\")","v":"-"},{"$f":"IFERROR(VLOOKUP(K56,Entries!$A:$D,4,0),\"-\")","v":"-"},{"$f":"IFERROR(VLOOKUP(K56,Entries!$A:$H,8,0),\"-\")","v":"-"},{"$f":"IFERROR(VLOOKUP(K56,Entries!$A:$F,6,0),\"-\")","v":"-"}]
[6,null,{"$f":"IFERROR(VLOOKUP(B57,Entries!$A:$E,5,0),\"-\")","v":"-"},{"$f":"IFERROR(VLOOKUP(B57,Entries!$A:$D,4,0),\"-\")","v":"-"},{"$f":"IFERROR(VLOOKUP(B57,Entries!$A:$H,8,0),\"-\")","v":"-"},{"$f":"IFERROR(VLOOKUP(B57,Entries!$A:$F,6,0),\"-\")","v":"-"},null,null,null,6,null,{"$f":"IFERROR(VLOOKUP(K57,Entries!$A:$E,5,0),\"-\")","v":"-"},{"$f":"IFERROR(VLOOKUP(K57,Entries!$A:$D,4,0),\"-\")","v":"-"},{"$f":"IFERROR(VLOOKUP(K57,Entries!$A:$H,8,0),\"-\")","v":"-"},{"$f":"IFERROR(VLOOKUP(K57,Entries!$A:$F,6,0),\"-\")","v":"-"}]
[7,null,{"$f":"IFERROR(VLOOKUP(B58,Entries!$A:$E,5,0),\"-\")","v":"-"},{"$f":"IFERROR(VLOOKUP(B58,Entries!$A:$D,4,0),\"-\")","v":"-"},{"$f":"IFERROR(VLOOKUP(B58,Entries!$A:$H,8,0),\"-\")","v":"-"},{"$f":"IFERROR(VLOOKUP(B58,Entries!$A:$F,6,0),\"-\")","v":"-"},null,null,null,7,null,{"$f":"IFERROR(VLOOKUP(K58,Entries!$A:$E,5,0),\"-\")","v":"-"},{"$f":"IFERROR(VLOOKUP(K58,Entries!$A:$D,4,0),\"-\")","v":"-"},{"$f":"IFERROR(VLOOKUP(K58,Entries!$A:$H,8,0),\"-\")","v":"-"},{"$f":"IFERROR(VLOOKUP(K58,Entries!$A:$F,6,0),\"-\")","v":"-"}]
[8,null,{"$f":"IFERROR(VLOOKUP(B59,Entries!$A:$E,5,0),\"-\")","v":"-"},{"$f":"IFERROR(VLOOKUP(B59,Entries!$A:$D,4,0),\"-\")","v":"-"},{"$f":"IFERROR(VLOOKUP(B59,Entries!$A:$H,8,0),\"-\")","v":"-"},{"$f":"IFERROR(VLOOKUP(B59,Entries!$A:$F,6,0),\"-\")","v":"-"},null,null,null,8,null,{"$f":"IFERROR(VLOOKUP(K59,Entries!$A:$E,5,0),\"-\")","v":"-"},{"$f":"IFERROR(VLOOKUP(K59,Entries!$A:$D,4,0),\"-\")","v":"-"},{"$f":"IFERROR(VLOOKUP(K59,Entries!$A:$H,8,0),\"-\")","v":"-"},{"$f":"IFERROR(VLOOKUP(K59,Entries!$A:$F,6,0),\"-\")","v":"-"}]
[9,null,{"$f":"IFERROR(VLOOKUP(B60,Entries!$A:$E,5,0),\"-\")","v":"-"},{"$f":"IFERROR(VLOOKUP(B60,Entries!$A:$D,4,0),\"-\")","v":"-"},{"$f":"IFERROR(VLOOKUP(B60,Entries!$A:$H,8,0),\"-\")","v":"-"},{"$f":"IFERROR(VLOOKUP(B60,Entries!$A:$F,6,0),\"-\")","v":"-"},null,null,null,9,null,{"$f":"IFERROR(VLOOKUP(K60,Entries!$A:$E,5,0),\"-\")","v":"-"},{"$f":"IFERROR(VLOOKUP(K60,Entries!$A:$D,4,0),\"-\")","v":"-"},{"$f":"IFERROR(VLOOKUP(K60,Entries!$A:$H,8,0),\"-\")","v":"-"},{"$f":"IFERROR(VLOOKUP(K60,Entries!$A:$F,6,0),\"-\")","v":"-"}]
[10,null,{"$f":"IFERROR(VLOOKUP(B61,Entries!$A:$E,5,0),\"-\")","v":"-"},{"$f":"IFERROR(VLOOKUP(B61,Entries!$A:$D,4,0),\"-\")","v":"-"},{"$f":"IFERROR(VLOOKUP(B61,Entries!$A:$H,8,0),\"-\")","v":"-"},{"$f":"IFERROR(VLOOKUP(B61,Entries!$A:$F,6,0),\"-\")","v":"-"},null,null,null,10,null,{"$f":"IFERROR(VLOOKUP(K61,Entries!$A:$E,5,0),\"-\")","v":"-"},{"$f":"IFERROR(VLOOKUP(K61,Entries!$A:$D,4,0),\"-\")","v":"-"},{"$f":"IFERROR(VLOOKUP(K61,Entries!$A:$H,8,0),\"-\")","v":"-"},{"$f":"IFERROR(VLOOKUP(K61,Entries!$A:$F,6,0),\"-\")","v":"-"}]

{"sheet":"Long Jump","index":15,"n_rows":110,"n_cols":17,"rows_kept":110,"cut":false,"hidden":false,"merged":[]}
["Long Jump"]
["U11 Boys (Yr4)",null,null,null,null,null,null,null,null,"U11 Girls Yr4"]
["Pos","Number","Last Name","First Name","Age","Club","Distance",null,null,"Pos","Number","Last Name","First Name","Age","Club","Distance","Wind"]
[1,84,{"$f":"IFERROR(VLOOKUP(B4,Entries!$A:$E,5,0),\"-\")","v":"Brazier"},{"$f":"IFERROR(VLOOKUP(B4,Entries!$A:$D,4,0),\"-\")","v":"James"},{"$f":"IFERROR(VLOOKUP(B4,Entries!$A:$H,8,0),\"-\")","v":9},{"$f":"IFERROR(VLOOKUP(B4,Entries!$A:$F,6,0),\"-\")","v":"SS Athletics"},"3.76",null,null,1,310,{"$f":"IFERROR(VLOOKUP(K4,Entries!$A:$E,5,0),\"-\")","v":"Lewis"},{"$f":"IFERROR(VLOOKUP(K4,Entries!$A:$D,4,0),\"-\")","v":"Emily"},{"$f":"IFERROR(VLOOKUP(K4,Entries!$A:$H,8,0),\"-\")","v":9},{"$f":"IFERROR(VLOOKUP(K4,Entries!$A:$F,6,0),\"-\")","v":"City of Southend On Sea AC"},"3.86"]
[2,304,{"$f":"IFERROR(VLOOKUP(B5,Entries!$A:$E,5,0),\"-\")","v":"Cole"},{"$f":"IFERROR(VLOOKUP(B5,Entries!$A:$D,4,0),\"-\")","v":"Tyatt"},{"$f":"IFERROR(VLOOKUP(B5,Entries!$A:$H,8,0),\"-\")","v":9},{"$f":"IFERROR(VLOOKUP(B5,Entries!$A:$F,6,0),\"-\")","v":"City of Southend On Sea AC"},"3.71",null,null,2,265,{"$f":"IFERROR(VLOOKUP(K5,Entries!$A:$E,5,0),\"-\")","v":"Hatt"},{"$f":"IFERROR(VLOOKUP(K5,Entries!$A:$D,4,0),\"-\")","v":"Jessica"},{"$f":"IFERROR(VLOOKUP(K5,Entries!$A:$H,8,0),\"-\")","v":9},{"$f":"IFERROR(VLOOKUP(K5,Entries!$A:$F,6,0),\"-\")","v":"SS Athletics"},"3.42"]
[3,88,{"$f":"IFERROR(VLOOKUP(B6,Entries!$A:$E,5,0),\"-\")","v":"Stammers"},{"$f":"IFERROR(VLOOKUP(B6,Entries!$A:$D,4,0),\"-\")","v":"Rafael"},{"$f":"IFERROR(VLOOKUP(B6,Entries!$A:$H,8,0),\"-\")","v":9},{"$f":"IFERROR(VLOOKUP(B6,Entries!$A:$F,6,0),\"-\")","v":"Unattached"},"3.56",null,null,3,111,{"$f":"IFERROR(VLOOKUP(K6,Entries!$A:$E,5,0),\"-\")","v":"Brook"},{"$f":"IFERROR(VLOOKUP(K6,Entries!$A:$D,4,0),\"-\")","v":"Edith"},{"$f":"IFERROR(VLOOKUP(K6,Entries!$A:$H,8,0),\"-\")","v":9},{"$f":"IFERROR(VLOOKUP(K6,Entries!$A:$F,6,0),\"-\")","v":"SS Athletics"},"3.32"]
[4,292,{"$f":"IFERROR(VLOOKUP(B7,Entries!$A:$E,5,0),\"-\")","v":"Smith"},{"$f":"IFERROR(VLOOKUP(B7,Entries!$A:$D,4,0),\"-\")","v":"Alex"},{"$f":"IFERROR(VLOOKUP(B7,Entries!$A:$H,8,0),\"-\")","v":9},{"$f":"IFERROR(VLOOKUP(B7,Entries!$A:$F,6,0),\"-\")","v":"Brentwood Beagles Athletics Club"},"3.48",null,null,4,339,{"$f":"IFERROR(VLOOKUP(K7,Entries!$A:$E,5,0),\"-\")","v":"Williams"},{"$f":"IFERROR(VLOOKUP(K7,Entries!$A:$D,4,0),\"-\")","v":"Tilly"},{"$f":"IFERROR(VLOOKUP(K7,Entries!$A:$H,8,0),\"-\")","v":9},"City of Southend On Sea AC","3.25"]
[5,314,{"$f":"IFERROR(VLOOKUP(B8,Entries!$A:$E,5,0),\"-\")","v":"Jackson"},{"$f":"IFERROR(VLOOKUP(B8,Entries!$A:$D,4,0),\"-\")","v":"Joshua"},{"$f":"IFERROR(VLOOKUP(B8,Entries!$A:$H,8,0),\"-\")","v":9},{"$f":"IFERROR(VLOOKUP(B8,Entries!$A:$F,6,0),\"-\")","v":"City of Southend-on-Sea Athletic Club"},"3.36",null,null,5,75,{"$f":"IFERROR(VLOOKUP(K8,Entries!$A:$E,5,0),\"-\")","v":"Webb"},{"$f":"IFERROR(VLOOKUP(K8,Entries!$A:$D,4,0),\"-\")","v":"Beatrice"},{"$f":"IFERROR(VLOOKUP(K8,Entries!$A:$H,8,0),\"-\")","v":9},{"$f":"IFERROR(VLOOKUP(K8,Entries!$A:$F,6,0),\"-\")","v":"SS Athletics"},"3.19"]
[6,307,{"$f":"IFERROR(VLOOKUP(B9,Entries!$A:$E,5,0),\"-\")","v":"Balisson"},{"$f":"IFERROR(VLOOKUP(B9,Entries!$A:$D,4,0),\"-\")","v":"Nathan"},{"$f":"IFERROR(VLOOKUP(B9,Entries!$A:$H,8,0),\"-\")","v":9},{"$f":"IFERROR(VLOOKUP(B9,Entries!$A:$F,6,0),\"-\")","v":"City of Southend On Sea AC"},"3.33",null,null,6,328,{"$f":"IFERROR(VLOOKUP(K9,Entries!$A:$E,5,0),\"-\")","v":"Hallahan"},{"$f":"IFERROR(VLOOKUP(K9,Entries!$A:$D,4,0),\"-\")","v":"Orlaith"},{"$f":"IFERROR(VLOOKUP(K9,Entries!$A:$H,8,0),\"-\")","v":9},{"$f":"IFERROR(VLOOKUP(K9,Entries!$A:$F,6,0),\"-\")","v":"Unattached"},"3.11"]
[7,144,{"$f":"IFERROR(VLOOKUP(B10,Entries!$A:$E,5,0),\"-\")","v":"Massey"},{"$f":"IFERROR(VLOOKUP(B10,Entries!$A:$D,4,0),\"-\")","v":"Angelo"},{"$f":"IFERROR(VLOOKUP(B10,Entries!$A:$H,8,0),\"-\")","v":9},{"$f":"IFERROR(VLOOKUP(B10,Entries!$A:$F,6,0),\"-\")","v":"Unattached"},"3.30",null," ",7,104,{"$f":"IFERROR(VLOOKUP(K10,Entries!$A:$E,5,0),\"-\")","v":"Townsend"},{"$f":"IFERROR(VLOOKUP(K10,Entries!$A:$D,4,0),\"-\")","v":"Kirsten"},{"$f":"IFERROR(VLOOKUP(K10,Entries!$A:$H,8,0),\"-\")","v":9},{"$f":"IFERROR(VLOOKUP(K10,Entries!$A:$F,6,0),\"-\")","v":"Colchester & Tendring AC"},"2.96"]
[8,124,{"$f":"IFERROR(VLOOKUP(B11,Entries!$A:$E,5,0),\"-\")","v":"McKeeganey"},{"$f":"IFERROR(VLOOKUP(B11,Entries!$A:$D,4,0),\"-\")","v":"Zach"},{"$f":"IFERROR(VLOOKUP(B11,Entries!$A:$H,8,0),\"-\")","v":9},{"$f":"IFERROR(VLOOKUP(B11,Entries!$A:$F,6,0),\"-\")","v":"SS Athletics"},"3.30",null,null,8,81,{"$f":"IFERROR(VLOOKUP(K11,Entries!$A:$E,5,0),\"-\")","v":"Abdelruhman"},{"$f":"IFERROR(VLOOKUP(K11,Entries!$A:$D,4,0),\"-\")","v":"Hannah"},{"$f":"IFERROR(VLOOKUP(K11,Entries!$A:$H,8,0),\"-\")","v":9},{"$f":"IFERROR(VLOOKUP(K11,Entries!$A:$F,6,0),\"-\")","v":"SS Athletics"},"2.35"]
[9,80,{"$f":"IFERROR(VLOOKUP(B12,Entries!$A:$E,5,0),\"-\")","v":"Cottee"},{"$f":"IFERROR(VLOOKUP(B12,Entries!$A:$D,4,0),\"-\")","v":"Nathan"},{"$f":"IFERROR(VLOOKUP(B12,Entries!$A:$H,8,0),\"-\")","v":9},{"$f":"IFERROR(VLOOKUP(B12,Entries!$A:$F,6,0),\"-\")","v":"Brentwood Beagles Athletics Club"},"3.04",null," ",9,null,{"$f":"IFERROR(VLOOKUP(K12,Entries!$A:$E,5,0),\"-\")","v":"-"},{"$f":"IFERROR(VLOOKUP(K12,Entries!$A:$D,4,0),\"-\")","v":"-"},{"$f":"IFERROR(VLOOKUP(K12,Entries!$A:$H,8,0),\"-\")","v":"-"},{"$f":"IFERROR(VLOOKUP(K12,Entries!$A:$F,6,0),\"-\")","v":"-"}]
[10,131,{"$f":"IFERROR(VLOOKUP(B13,Entries!$A:$E,5,0),\"-\")","v":"Fox"},{"$f":"IFERROR(VLOOKUP(B13,Entries!$A:$D,4,0),\"-\")","v":"Hari"},{"$f":"IFERROR(VLOOKUP(B13,Entries!$A:$H,8,0),\"-\")","v":9},{"$f":"IFERROR(VLOOKUP(B13,Entries!$A:$F,6,0),\"-\")","v":"Unattached"},"2.61",null,null,10,null,{"$f":"IFERROR(VLOOKUP(K13,Entries!$A:$E,5,0),\"-\")","v":"-"},{"$f":"IFERROR(VLOOKUP(K13,Entries!$A:$D,4,0),\"-\")","v":"-"},{"$f":"IFERROR(VLOOKUP(K13,Entries!$A:$H,8,0),\"-\")","v":"-"},{"$f":"IFERROR(VLOOKUP(K13,Entries!$A:$F,6,0),\"-\")","v":"-"}]
[]
["U11 Boys (Yr5)",null,null,null,null,null,null,null,null,"U11 Girls Yr5"]
["Pos","Number","Last Name","First Name","Age","Club","Distance","Wind",null,"Pos","Number","Last Name","First Name","Age","Club","Distance","Wind"]
[1,93,{"$f":"IFERROR(VLOOKUP(B17,Entries!$A:$E,5,0),\"-\")","v":"Hollidge"},{"$f":"IFERROR(VLOOKUP(B17,Entries!$A:$D,4,0),\"-\")","v":"Eli"},{"$f":"IFERROR(VLOOKUP(B17,Entries!$A:$H,8,0),\"-\")","v":10},{"$f":"IFERROR(VLOOKUP(B17,Entries!$A:$F,6,0),\"-\")","v":"SS Athletics"},"3.65",null,null,1,325,{"$f":"IFERROR(VLOOKUP(K17,Entries!$A:$E,5,0),\"-\")","v":"Ncube"},{"$f":"IFERROR(VLOOKUP(K17,Entries!$A:$D,4,0),\"-\")","v":"Ruvarashe"},{"$f":"IFERROR(VLOOKUP(K17,Entries!$A:$H,8,0),\"-\")","v":10},{"$f":"IFERROR(VLOOKUP(K17,Entries!$A:$F,6,0),\"-\")","v":"City of Southend-on-Sea Athletic Club"},"3.12"]
[2,226,{"$f":"IFERROR(VLOOKUP(B18,Entries!$A:$E,5,0),\"-\")","v":"Jones"},{"$f":"IFERROR(VLOOKUP(B18,Entries!$A:$D,4,0),\"-\")","v":"Oliver"},{"$f":"IFERROR(VLOOKUP(B18,Entries!$A:$H,8,0),\"-\")","v":10},{"$f":"IFERROR(VLOOKUP(B18,Entries!$A:$F,6,0),\"-\")","v":"Unattached"},"3.46",null,null,2,66,{"$f":"IFERROR(VLOOKUP(K18,Entries!$A:$E,5,0),\"-\")","v":"Hay"},{"$f":"IFERROR(VLOOKUP(K18,Entries!$A:$D,4,0),\"-\")","v":"Bonnie"},{"$f":"IFERROR(VLOOKUP(K18,Entries!$A:$H,8,0),\"-\")","v":10},{"$f":"IFERROR(VLOOKUP(K18,Entries!$A:$F,6,0),\"-\")","v":"SS Athletics"},"3.02"]
[3,172,{"$f":"IFERROR(VLOOKUP(B19,Entries!$A:$E,5,0),\"-\")","v":"Lupton"},{"$f":"IFERROR(VLOOKUP(B19,Entries!$A:$D,4,0),\"-\")","v":"Joseph"},{"$f":"IFERROR(VLOOKUP(B19,Entries!$A:$H,8,0),\"-\")","v":10},{"$f":"IFERROR(VLOOKUP(B19,Entries!$A:$F,6,0),\"-\")","v":"SS Athletics"},"3.45",null,null,3,149,{"$f":"IFERROR(VLOOKUP(K19,Entries!$A:$E,5,0),\"-\")","v":"Lyttle"},{"$f":"IFERROR(VLOOKUP(K19,Entries!$A:$D,4,0),\"-\")","v":"Sofia"},{"$f":"IFERROR(VLOOKUP(K19,Entries!$A:$H,8,0),\"-\")","v":10},{"$f":"IFERROR(VLOOKUP(K19,Entries!$A:$F,6,0),\"-\")","v":"Colchester & Tendring AC"},"3.00"]
[4,205,{"$f":"IFERROR(VLOOKUP(B20,Entries!$A:$E,5,0),\"-\")","v":"Webb"},{"$f":"IFERROR(VLOOKUP(B20,Entries!$A:$D,4,0),\"-\")","v":"Jude"},{"$f":"IFERROR(VLOOKUP(B20,Entries!$A:$H,8,0),\"-\")","v":10},{"$f":"IFERROR(VLOOKUP(B20,Entries!$A:$F,6,0),\"-\")","v":"SS Athletics"},"3.42",null,null,4,108,{"$f":"IFERROR(VLOOKUP(K20,Entries!$A:$E,5,0),\"-\")","v":"Silvain"},{"$f":"IFERROR(VLOOKUP(K20,Entries!$A:$D,4,0),\"-\")","v":"Ella"},{"$f":"IFERROR(VLOOKUP(K20,Entries!$A:$H,8,0),\"-\")","v":10},{"$f":"IFERROR(VLOOKUP(K20,Entries!$A:$F,6,0),\"-\")","v":"Unattached"},"2.98"]
[5,377,{"$f":"IFERROR(VLOOKUP(B21,Entries!$A:$E,5,0),\"-\")","v":"M Kelly"},{"$f":"IFERROR(VLOOKUP(B21,Entries!$A:$D,4,0),\"-\")","v":"Olly"},{"$f":"IFERROR(VLOOKUP(B21,Entries!$A:$H,8,0),\"-\")","v":10},{"$f":"IFERROR(VLOOKUP(B21,Entries!$A:$F,6,0),\"-\")","v":"Ipswich Jaffa RC"},"2.25",null,null,5,171,{"$f":"IFERROR(VLOOKUP(K21,Entries!$A:$E,5,0),\"-\")","v":"Lupton"},{"$f":"IFERROR(VLOOKUP(K21,Entries!$A:$D,4,0),\"-\")","v":"Hollie"},{"$f":"IFERROR(VLOOKUP(K21,Entries!$A:$H,8,0),\"-\")","v":10},{"$f":"IFERROR(VLOOKUP(K21,Entries!$A:$F,6,0),\"-\")","v":"SS Athletics"},"2.91"]
[6,null,{"$f":"IFERROR(VLOOKUP(B22,Entries!$A:$E,5,0),\"-\")","v":"-"},{"$f":"IFERROR(VLOOKUP(B22,Entries!$A:$D,4,0),\"-\")","v":"-"},{"$f":"IFERROR(VLOOKUP(B22,Entries!$A:$H,8,0),\"-\")","v":"-"},{"$f":"IFERROR(VLOOKUP(B22,Entries!$A:$F,6,0),\"-\")","v":"-"},null,null,null,6,294,{"$f":"IFERROR(VLOOKUP(K22,Entries!$A:$E,5,0),\"-\")","v":"Cain"},{"$f":"IFERROR(VLOOKUP(K22,Entries!$A:$D,4,0),\"-\")","v":"Ivy"},{"$f":"IFERROR(VLOOKUP(K22,Entries!$A:$H,8,0),\"-\")","v":10},{"$f":"IFERROR(VLOOKUP(K22,Entries!$A:$F,6,0),\"-\")","v":"City of Southend On Sea AC"},"2.88"]
[7,null,{"$f":"IFERROR(VLOOKUP(B23,Entries!$A:$E,5,0),\"-\")","v":"-"},{"$f":"IFERROR(VLOOKUP(B23,Entries!$A:$D,4,0),\"-\")","v":"-"},{"$f":"IFERROR(VLOOKUP(B23,Entries!$A:$H,8,0),\"-\")","v":"-"},{"$f":"IFERROR(VLOOKUP(B23,Entries!$A:$F,6,0),\"-\")","v":"-"},null,null,null,7,9,{"$f":"IFERROR(VLOOKUP(K23,Entries!$A:$E,5,0),\"-\")","v":"Brewington"},{"$f":"IFERROR(VLOOKUP(K23,Entries!$A:$D,4,0),\"-\")","v":"Emily"},{"$f":"IFERROR(VLOOKUP(K23,Entries!$A:$H,8,0),\"-\")","v":10},{"$f":"IFERROR(VLOOKUP(K23,Entries!$A:$F,6,0),\"-\")","v":"Brentwood Beagles Athletics Club"},"2.80"]
[8,null,{"$f":"IFERROR(VLOOKUP(B24,Entries!$A:$E,5,0),\"-\")","v":"-"},{"$f":"IFERROR(VLOOKUP(B24,Entries!$A:$D,4,0),\"-\")","v":"-"},{"$f":"IFERROR(VLOOKUP(B24,Entries!$A:$H,8,0),\"-\")","v":"-"},{"$f":"IFERROR(VLOOKUP(B24,Entries!$A:$F,6,0),\"-\")","v":"-"},null,null,null,8,375,{"$f":"IFERROR(VLOOKUP(K24,Entries!$A:$E,5,0),\"-\")","v":"Heath"},{"$f":"IFERROR(VLOOKUP(K24,Entries!$A:$D,4,0),\"-\")","v":"Naomi"},{"$f":"IFERROR(VLOOKUP(K24,Entries!$A:$H,8,0),\"-\")","v":10},{"$f":"IFERROR(VLOOKUP(K24,Entries!$A:$F,6,0),\"-\")","v":"SS Athletics"},"2.72"]
[9,null,{"$f":"IFERROR(VLOOKUP(B25,Entries!$A:$E,5,0),\"-\")","v":"-"},{"$f":"IFERROR(VLOOKUP(B25,Entries!$A:$D,4,0),\"-\")","v":"-"},{"$f":"IFERROR(VLOOKUP(B25,Entries!$A:$H,8,0),\"-\")","v":"-"},{"$f":"IFERROR(VLOOKUP(B25,Entries!$A:$F,6,0),\"-\")","v":"-"},null,null,null,9,15,{"$f":"IFERROR(VLOOKUP(K25,Entries!$A:$E,5,0),\"-\")","v":"Ekerin"},{"$f":"IFERROR(VLOOKUP(K25,Entries!$A:$D,4,0),\"-\")","v":"Temitope"},{"$f":"IFERROR(VLOOKUP(K25,Entries!$A:$H,8,0),\"-\")","v":10},{"$f":"IFERROR(VLOOKUP(K25,Entries!$A:$F,6,0),\"-\")","v":"Unattached"},"2.34"]
[10,null,{"$f":"IFERROR(VLOOKUP(B26,Entries!$A:$E,5,0),\"-\")","v":"-"},{"$f":"IFERROR(VLOOKUP(B26,Entries!$A:$D,4,0),\"-\")","v":"-"},{"$f":"IFERROR(VLOOKUP(B26,Entries!$A:$H,8,0),\"-\")","v":"-"},{"$f":"IFERROR(VLOOKUP(B26,Entries!$A:$F,6,0),\"-\")","v":"-"},null,null,null,10,null,{"$f":"IFERROR(VLOOKUP(K26,Entries!$A:$E,5,0),\"-\")","v":"-"},{"$f":"IFERROR(VLOOKUP(K26,Entries!$A:$D,4,0),\"-\")","v":"-"},{"$f":"IFERROR(VLOOKUP(K26,Entries!$A:$H,8,0),\"-\")","v":"-"},{"$f":"IFERROR(VLOOKUP(K26,Entries!$A:$F,6,0),\"-\")","v":"-"}]
[]
[]
["U13 Boys (Yr6)",null,null,null,null,null,null,null,null,"U13 Girls Yr6"]
["Pos","Number","Last Name","First Name","Age","Club","Distance","Wind",null,"Pos","Number","Last Name","First Name","Age","Club","Distance","Wind"]
[1,40,{"$f":"IFERROR(VLOOKUP(B31,Entries!$A:$E,5,0),\"-\")","v":"Cheetham"},{"$f":"IFERROR(VLOOKUP(B31,Entries!$A:$D,4,0),\"-\")","v":"Max"},{"$f":"IFERROR(VLOOKUP(B31,Entries!$A:$H,8,0),\"-\")","v":11},{"$f":"IFERROR(VLOOKUP(B31,Entries!$A:$F,6,0),\"-\")","v":"Brentwood Beagles Athletics Club"},"4.22",null,null,1,77,{"$f":"IFERROR(VLOOKUP(K31,Entries!$A:$E,5,0),\"-\")","v":"Oladele"},{"$f":"IFERROR(VLOOKUP(K31,Entries!$A:$D,4,0),\"-\")","v":"Davina"},{"$f":"IFERROR(VLOOKUP(K31,Entries!$A:$H,8,0),\"-\")","v":11},{"$f":"IFERROR(VLOOKUP(K31,Entries!$A:$F,6,0),\"-\")","v":"Thurrock Harriers"},"4.49"]
[2,98,{"$f":"IFERROR(VLOOKUP(B32,Entries!$A:$E,5,0),\"-\")","v":"Lupton"},{"$f":"IFERROR(VLOOKUP(B32,Entries!$A:$D,4,0),\"-\")","v":"Oliver"},{"$f":"IFERROR(VLOOKUP(B32,Entries!$A:$H,8,0),\"-\")","v":11},{"$f":"IFERROR(VLOOKUP(B32,Entries!$A:$F,6,0),\"-\")","v":"SS Athletics"},"4.16",null,null,2,276,{"$f":"IFERROR(VLOOKUP(K32,Entries!$A:$E,5,0),\"-\")","v":"Martell-Smith"},{"$f":"IFERROR(VLOOKUP(K32,Entries!$A:$D,4,0),\"-\")","v":"Lacey"},{"$f":"IFERROR(VLOOKUP(K32,Entries!$A:$H,8,0),\"-\")","v":11},{"$f":"IFERROR(VLOOKUP(K32,Entries!$A:$F,6,0),\"-\")","v":"Colchester Harriers AC"},"3.90"]
[3,126,{"$f":"IFERROR(VLOOKUP(B33,Entries!$A:$E,5,0),\"-\")","v":"Fahmy"},{"$f":"IFERROR(VLOOKUP(B33,Entries!$A:$D,4,0),\"-\")","v":"Seif"},{"$f":"IFERROR(VLOOKUP(B33,Entries!$A:$H,8,0),\"-\")","v":11},{"$f":"IFERROR(VLOOKUP(B33,Entries!$A:$F,6,0),\"-\")","v":"SS Athletics"},"3.95",null,null,3,151,{"$f":"IFERROR(VLOOKUP(K33,Entries!$A:$E,5,0),\"-\")","v":"Radley"},{"$f":"IFERROR(VLOOKUP(K33,Entries!$A:$D,4,0),\"-\")","v":"Lucia"},{"$f":"IFERROR(VLOOKUP(K33,Entries!$A:$H,8,0),\"-\")","v":11},{"$f":"IFERROR(VLOOKUP(K33,Entries!$A:$F,6,0),\"-\")","v":"SS Athletics"},"3.79"]
[4,160,{"$f":"IFERROR(VLOOKUP(B34,Entries!$A:$E,5,0),\"-\")","v":"Phillips-Frontin"},{"$f":"IFERROR(VLOOKUP(B34,Entries!$A:$D,4,0),\"-\")","v":"Dylan"},{"$f":"IFERROR(VLOOKUP(B34,Entries!$A:$H,8,0),\"-\")","v":11},{"$f":"IFERROR(VLOOKUP(B34,Entries!$A:$F,6,0),\"-\")","v":"SS Athletics"},"3.72",null,null,4,315,{"$f":"IFERROR(VLOOKUP(K34,Entries!$A:$E,5,0),\"-\")","v":"Turner"},{"$f":"IFERROR(VLOOKUP(K34,Entries!$A:$D,4,0),\"-\")","v":"Amelia-Rose"},{"$f":"IFERROR(VLOOKUP(K34,Entries!$A:$H,8,0),\"-\")","v":11},{"$f":"IFERROR(VLOOKUP(K34,Entries!$A:$F,6,0),\"-\")","v":"SS Athletics"},"3.75"]
[5,370,{"$f":"IFERROR(VLOOKUP(B35,Entries!$A:$E,5,0),\"-\")","v":"Partridge"},{"$f":"IFERROR(VLOOKUP(B35,Entries!$A:$D,4,0),\"-\")","v":"Mason"},{"$f":"IFERROR(VLOOKUP(B35,Entries!$A:$H,8,0),\"-\")","v":11},{"$f":"IFERROR(VLOOKUP(B35,Entries!$A:$F,6,0),\"-\")","v":"Colchester & Tendring AC"},"3.59",null,null,5,266,{"$f":"IFERROR(VLOOKUP(K35,Entries!$A:$E,5,0),\"-\")","v":"Tubman"},{"$f":"IFERROR(VLOOKUP(K35,Entries!$A:$D,4,0),\"-\")","v":"Ciara"},{"$f":"IFERROR(VLOOKUP(K35,Entries!$A:$H,8,0),\"-\")","v":11},{"$f":"IFERROR(VLOOKUP(K35,Entries!$A:$F,6,0),\"-\")","v":"City of Southend On Sea AC"},"3.68"]
[6,132,{"$f":"IFERROR(VLOOKUP(B36,Entries!$A:$E,5,0),\"-\")","v":"Fox"},{"$f":"IFERROR(VLOOKUP(B36,Entries!$A:$D,4,0),\"-\")","v":"Ketan"},{"$f":"IFERROR(VLOOKUP(B36,Entries!$A:$H,8,0),\"-\")","v":11},{"$f":"IFERROR(VLOOKUP(B36,Entries!$A:$F,6,0),\"-\")","v":"Unattached"},"3.34",null,null,6,253,{"$f":"IFERROR(VLOOKUP(K36,Entries!$A:$E,5,0),\"-\")","v":"Motin"},{"$f":"IFERROR(VLOOKUP(K36,Entries!$A:$D,4,0),\"-\")","v":"Sofia"},{"$f":"IFERROR(VLOOKUP(K36,Entries!$A:$H,8,0),\"-\")","v":11},{"$f":"IFERROR(VLOOKUP(K36,Entries!$A:$F,6,0),\"-\")","v":"City of Southend On Sea AC"},"3.24"]
[7,291,{"$f":"IFERROR(VLOOKUP(B37,Entries!$A:$E,5,0),\"-\")","v":"Smith"},{"$f":"IFERROR(VLOOKUP(B37,Entries!$A:$D,4,0),\"-\")","v":"George"},{"$f":"IFERROR(VLOOKUP(B37,Entries!$A:$H,8,0),\"-\")","v":11},{"$f":"IFERROR(VLOOKUP(B37,Entries!$A:$F,6,0),\"-\")","v":"Brentwood Beagles Athletics Club"},"3.14",null,null,7,299,{"$f":"IFERROR(VLOOKUP(K37,Entries!$A:$E,5,0),\"-\")","v":"Palmer-Traer"},{"$f":"IFERROR(VLOOKUP(K37,Entries!$A:$D,4,0),\"-\")","v":"Ella"},{"$f":"IFERROR(VLOOKUP(K37,Entries!$A:$H,8,0),\"-\")","v":11},{"$f":"IFERROR(VLOOKUP(K37,Entries!$A:$F,6,0),\"-\")","v":"City of Southend On Sea AC"},"3.15"]
[8,248,{"$f":"IFERROR(VLOOKUP(B38,Entries!$A:$E,5,0),\"-\")","v":"Rumsby"},{"$f":"IFERROR(VLOOKUP(B38,Entries!$A:$D,4,0),\"-\")","v":"Noah"},{"$f":"IFERROR(VLOOKUP(B38,Entries!$A:$H,8,0),\"-\")","v":11},{"$f":"IFERROR(VLOOKUP(B38,Entries!$A:$F,6,0),\"-\")","v":"SS Athletics"},"2.92",null,null,8,38,{"$f":"IFERROR(VLOOKUP(K38,Entries!$A:$E,5,0),\"-\")","v":"Gault-Poyntz"},{"$f":"IFERROR(VLOOKUP(K38,Entries!$A:$D,4,0),\"-\")","v":"Allegra"},{"$f":"IFERROR(VLOOKUP(K38,Entries!$A:$H,8,0),\"-\")","v":11},{"$f":"IFERROR(VLOOKUP(K38,Entries!$A:$F,6,0),\"-\")","v":"City of Southend On Sea AC"},"3.09"]
[9,286,{"$f":"IFERROR(VLOOKUP(B39,Entries!$A:$E,5,0),\"-\")","v":"Heaton"},{"$f":"IFERROR(VLOOKUP(B39,Entries!$A:$D,4,0),\"-\")","v":"Alex"},{"$f":"IFERROR(VLOOKUP(B39,Entries!$A:$H,8,0),\"-\")","v":11},{"$f":"IFERROR(VLOOKUP(B39,Entries!$A:$F,6,0),\"-\")","v":"Castle Point Joggers"},"2.84",null,null,9,301,{"$f":"IFERROR(VLOOKUP(K39,Entries!$A:$E,5,0),\"-\")","v":"Robson"},{"$f":"IFERROR(VLOOKUP(K39,Entries!$A:$D,4,0),\"-\")","v":"Alexandra"},{"$f":"IFERROR(VLOOKUP(K39,Entries!$A:$H,8,0),\"-\")","v":11},{"$f":"IFERROR(VLOOKUP(K39,Entries!$A:$F,6,0),\"-\")","v":"SS Athletics"},"3.03"]
[10,null,{"$f":"IFERROR(VLOOKUP(B40,Entries!$A:$E,5,0),\"-\")","v":"-"},{"$f":"IFERROR(VLOOKUP(B40,Entries!$A:$D,4,0),\"-\")","v":"-"},{"$f":"IFERROR(VLOOKUP(B40,Entries!$A:$H,8,0),\"-\")","v":"-"},{"$f":"IFERROR(VLOOKUP(B40,Entries!$A:$F,6,0),\"-\")","v":"-"},null,null,null,10,null,{"$f":"IFERROR(VLOOKUP(K40,Entries!$A:$E,5,0),\"-\")","v":"-"},{"$f":"IFERROR(VLOOKUP(K40,Entries!$A:$D,4,0),\"-\")","v":"-"},{"$f":"IFERROR(VLOOKUP(K40,Entries!$A:$H,8,0),\"-\")","v":"-"},{"$f":"IFERROR(VLOOKUP(K40,Entries!$A:$F,6,0),\"-\")","v":"-"}]
[]
[]
["U13 Boys (Yr7)",null,null,null,null,null,null,null,null,"U13 Girls (Yr7)"]
["Pos","Number","Last Name","First Name","Age","Club","Distance","Wind",null,"Pos","Number","Last Name","First Name","Age","Club","Distance","Wind"]
[1,65,{"$f":"IFERROR(VLOOKUP(B45,Entries!$A:$E,5,0),\"-\")","v":"Hay"},{"$f":"IFERROR(VLOOKUP(B45,Entries!$A:$D,4,0),\"-\")","v":"Logan"},{"$f":"IFERROR(VLOOKUP(B45,Entries!$A:$H,8,0),\"-\")","v":12},{"$f":"IFERROR(VLOOKUP(B45,Entries!$A:$F,6,0),\"-\")","v":"SS Athletics"},"4.63",null,null,1,11,{"$f":"IFERROR(VLOOKUP(K45,Entries!$A:$E,5,0),\"-\")","v":"Frisby"},{"$f":"IFERROR(VLOOKUP(K45,Entries!$A:$D,4,0),\"-\")","v":"Emma"},{"$f":"IFERROR(VLOOKUP(K45,Entries!$A:$H,8,0),\"-\")","v":12},{"$f":"IFERROR(VLOOKUP(K45,Entries!$A:$F,6,0),\"-\")","v":"City of Southend On Sea AC"},"4.65"]
[2,52,{"$f":"IFERROR(VLOOKUP(B46,Entries!$A:$E,5,0),\"-\")","v":"Stone"},{"$f":"IFERROR(VLOOKUP(B46,Entries!$A:$D,4,0),\"-\")","v":"Bradley"},{"$f":"IFERROR(VLOOKUP(B46,Entries!$A:$H,8,0),\"-\")","v":12},{"$f":"IFERROR(VLOOKUP(B46,Entries!$A:$F,6,0),\"-\")","v":"Hillingdon AC"},"4.62",null,null,2,99,{"$f":"IFERROR(VLOOKUP(K46,Entries!$A:$E,5,0),\"-\")","v":"Bozorgi"},{"$f":"IFERROR(VLOOKUP(K46,Entries!$A:$D,4,0),\"-\")","v":"Dina"},{"$f":"IFERROR(VLOOKUP(K46,Entries!$A:$H,8,0),\"-\")","v":12},{"$f":"IFERROR(VLOOKUP(K46,Entries!$A:$F,6,0),\"-\")","v":"Watford Harriers"},"4.52"]
[3,119,{"$f":"IFERROR(VLOOKUP(B47,Entries!$A:$E,5,0),\"-\")","v":"Petherbridge"},{"$f":"IFERROR(VLOOKUP(B47,Entries!$A:$D,4,0),\"-\")","v":"Zac"},{"$f":"IFERROR(VLOOKUP(B47,Entries!$A:$H,8,0),\"-\")","v":12},{"$f":"IFERROR(VLOOKUP(B47,Entries!$A:$F,6,0),\"-\")","v":"SS Athletics"},"4.62",null,null,3,229,{"$f":"IFERROR(VLOOKUP(K47,Entries!$A:$E,5,0),\"-\")","v":"Taylor"},{"$f":"IFERROR(VLOOKUP(K47,Entries!$A:$D,4,0),\"-\")","v":"Scarlett"},{"$f":"IFERROR(VLOOKUP(K47,Entries!$A:$H,8,0),\"-\")","v":12},{"$f":"IFERROR(VLOOKUP(K47,Entries!$A:$F,6,0),\"-\")","v":"Aldershot Farnham & District"},"4.49"]
[4,118,{"$f":"IFERROR(VLOOKUP(B48,Entries!$A:$E,5,0),\"-\")","v":"Petherbridge"},{"$f":"IFERROR(VLOOKUP(B48,Entries!$A:$D,4,0),\"-\")","v":"Finn"},{"$f":"IFERROR(VLOOKUP(B48,Entries!$A:$H,8,0),\"-\")","v":12},{"$f":"IFERROR(VLOOKUP(B48,Entries!$A:$F,6,0),\"-\")","v":"SS Athletics"},"4.52",null,null,4,78,{"$f":"IFERROR(VLOOKUP(K48,Entries!$A:$E,5,0),\"-\")","v":"Simpson"},{"$f":"IFERROR(VLOOKUP(K48,Entries!$A:$D,4,0),\"-\")","v":"Kylin"},{"$f":"IFERROR(VLOOKUP(K48,Entries!$A:$H,8,0),\"-\")","v":12},{"$f":"IFERROR(VLOOKUP(K48,Entries!$A:$F,6,0),\"-\")","v":"Aldershot Farnham & District"},"4.36"]
[5,114,{"$f":"IFERROR(VLOOKUP(B49,Entries!$A:$E,5,0),\"-\")","v":"Lee"},{"$f":"IFERROR(VLOOKUP(B49,Entries!$A:$D,4,0),\"-\")","v":"Charlie"},{"$f":"IFERROR(VLOOKUP(B49,Entries!$A:$H,8,0),\"-\")","v":12},{"$f":"IFERROR(VLOOKUP(B49,Entries!$A:$F,6,0),\"-\")","v":"SS Athletics"},"3.63",null,null,5,249,{"$f":"IFERROR(VLOOKUP(K49,Entries!$A:$E,5,0),\"-\")","v":"Boamah"},{"$f":"IFERROR(VLOOKUP(K49,Entries!$A:$D,4,0),\"-\")","v":"Bria"},{"$f":"IFERROR(VLOOKUP(K49,Entries!$A:$H,8,0),\"-\")","v":12},{"$f":"IFERROR(VLOOKUP(K49,Entries!$A:$F,6,0),\"-\")","v":"Herts Phoenix AC"},"3.98"]
[6,null,{"$f":"IFERROR(VLOOKUP(B50,Entries!$A:$E,5,0),\"-\")","v":"-"},{"$f":"IFERROR(VLOOKUP(B50,Entries!$A:$D,4,0),\"-\")","v":"-"},{"$f":"IFERROR(VLOOKUP(B50,Entries!$A:$H,8,0),\"-\")","v":"-"},{"$f":"IFERROR(VLOOKUP(B50,Entries!$A:$F,6,0),\"-\")","v":"-"},null,null,null,6,138,{"$f":"IFERROR(VLOOKUP(K50,Entries!$A:$E,5,0),\"-\")","v":"Marshment"},{"$f":"IFERROR(VLOOKUP(K50,Entries!$A:$D,4,0),\"-\")","v":"Bella"},{"$f":"IFERROR(VLOOKUP(K50,Entries!$A:$H,8,0),\"-\")","v":12},{"$f":"IFERROR(VLOOKUP(K50,Entries!$A:$F,6,0),\"-\")","v":"Herts Phoenix AC"},"3.91"]
[7,null,{"$f":"IFERROR(VLOOKUP(B51,Entries!$A:$E,5,0),\"-\")","v":"-"},{"$f":"IFERROR(VLOOKUP(B51,Entries!$A:$D,4,0),\"-\")","v":"-"},{"$f":"IFERROR(VLOOKUP(B51,Entries!$A:$H,8,0),\"-\")","v":"-"},{"$f":"IFERROR(VLOOKUP(B51,Entries!$A:$F,6,0),\"-\")","v":"-"},null,null,null,7,100,{"$f":"IFERROR(VLOOKUP(K51,Entries!$A:$E,5,0),\"-\")","v":"Scragg"},{"$f":"IFERROR(VLOOKUP(K51,Entries!$A:$D,4,0),\"-\")","v":"Abigail"},{"$f":"IFERROR(VLOOKUP(K51,Entries!$A:$H,8,0),\"-\")","v":12},{"$f":"IFERROR(VLOOKUP(K51,Entries!$A:$F,6,0),\"-\")","v":"Camberley & District AC"},"3.66"]
[8,null,{"$f":"IFERROR(VLOOKUP(B52,Entries!$A:$E,5,0),\"-\")","v":"-"},{"$f":"IFERROR(VLOOKUP(B52,Entries!$A:$D,4,0),\"-\")","v":"-"},{"$f":"IFERROR(VLOOKUP(B52,Entries!$A:$H,8,0),\"-\")","v":"-"},{"$f":"IFERROR(VLOOKUP(B52,Entries!$A:$F,6,0),\"-\")","v":"-"},null,null,null,8,67,{"$f":"IFERROR(VLOOKUP(K52,Entries!$A:$E,5,0),\"-\")","v":"Tasneem"},{"$f":"IFERROR(VLOOKUP(K52,Entries!$A:$D,4,0),\"-\")","v":"Evie"},{"$f":"IFERROR(VLOOKUP(K52,Entries!$A:$H,8,0),\"-\")","v":12},{"$f":"IFERROR(VLOOKUP(K52,Entries!$A:$F,6,0),\"-\")","v":"Basildon AC"},"3.36"]
[9,null,{"$f":"IFERROR(VLOOKUP(B53,Entries!$A:$E,5,0),\"-\")","v":"-"},{"$f":"IFERROR(VLOOKUP(B53,Entries!$A:$D,4,0),\"-\")","v":"-"},{"$f":"IFERROR(VLOOKUP(B53,Entries!$A:$H,8,0),\"-\")","v":"-"},{"$f":"IFERROR(VLOOKUP(B53,Entries!$A:$F,6,0),\"-\")","v":"-"},null,null,null,9,null,{"$f":"IFERROR(VLOOKUP(K53,Entries!$A:$E,5,0),\"-\")","v":"-"},{"$f":"IFERROR(VLOOKUP(K53,Entries!$A:$D,4,0),\"-\")","v":"-"},{"$f":"IFERROR(VLOOKUP(K53,Entries!$A:$H,8,0),\"-\")","v":"-"},{"$f":"IFERROR(VLOOKUP(K53,Entries!$A:$F,6,0),\"-\")","v":"-"}]
[10,null,{"$f":"IFERROR(VLOOKUP(B54,Entries!$A:$E,5,0),\"-\")","v":"-"},{"$f":"IFERROR(VLOOKUP(B54,Entries!$A:$D,4,0),\"-\")","v":"-"},{"$f":"IFERROR(VLOOKUP(B54,Entries!$A:$H,8,0),\"-\")","v":"-"},{"$f":"IFERROR(VLOOKUP(B54,Entries!$A:$F,6,0),\"-\")","v":"-"},null,null,null,10,null,{"$f":"IFERROR(VLOOKUP(K54,Entries!$A:$E,5,0),\"-\")","v":"-"},{"$f":"IFERROR(VLOOKUP(K54,Entries!$A:$D,4,0),\"-\")","v":"-"},{"$f":"IFERROR(VLOOKUP(K54,Entries!$A:$H,8,0),\"-\")","v":"-"},{"$f":"IFERROR(VLOOKUP(K54,Entries!$A:$F,6,0),\"-\")","v":"-"}]
[]
[]
["U15 Men",null,null,null,null,null,null,null,null,"U15 Girls"]
["Pos","Number","Last Name","First Name","Age","Club","Distance","Wind",null,"Pos","Number","Last Name","First Name","Age","Club","Distance","Wind"]
[1,238,{"$f":"IFERROR(VLOOKUP(B59,Entries!$A:$E,5,0),\"-\")","v":"Patrick"},{"$f":"IFERROR(VLOOKUP(B59,Entries!$A:$D,4,0),\"-\")","v":"Luca"},{"$f":"IFERROR(VLOOKUP(B59,Entries!$A:$H,8,0),\"-\")","v":14},{"$f":"IFERROR(VLOOKUP(B59,Entries!$A:$F,6,0),\"-\")","v":"Brentwood Beagles Athletics Club"},"5.02",null,null,1,62,{"$f":"IFERROR(VLOOKUP(K59,Entries!$A:$E,5,0),\"-\")","v":"Barker"},{"$f":"IFERROR(VLOOKUP(K59,Entries!$A:$D,4,0),\"-\")","v":"Isla"},{"$f":"IFERROR(VLOOKUP(K59,Entries!$A:$H,8,0),\"-\")","v":14},{"$f":"IFERROR(VLOOKUP(K59,Entries!$A:$F,6,0),\"-\")","v":"Ipswich Harriers"},"5.17"]
[2,52,{"$f":"IFERROR(VLOOKUP(B60,Entries!$A:$E,5,0),\"-\")","v":"Stone"},{"$f":"IFERROR(VLOOKUP(B60,Entries!$A:$D,4,0),\"-\")","v":"Bradley"},{"$f":"IFERROR(VLOOKUP(B60,Entries!$A:$H,8,0),\"-\")","v":12},{"$f":"IFERROR(VLOOKUP(B60,Entries!$A:$F,6,0),\"-\")","v":"Hillingdon AC"},"4.35",null,null,2,27,{"$f":"IFERROR(VLOOKUP(K60,Entries!$A:$E,5,0),\"-\")","v":"Boygle"},{"$f":"IFERROR(VLOOKUP(K60,Entries!$A:$D,4,0),\"-\")","v":"Evie"},{"$f":"IFERROR(VLOOKUP(K60,Entries!$A:$H,8,0),\"-\")","v":13},{"$f":"IFERROR(VLOOKUP(K60,Entries!$A:$F,6,0),\"-\")","v":"City of Southend On Sea AC"},"5.02"]
[3,null,{"$f":"IFERROR(VLOOKUP(B61,Entries!$A:$E,5,0),\"-\")","v":"-"},{"$f":"IFERROR(VLOOKUP(B61,Entries!$A:$D,4,0),\"-\")","v":"-"},{"$f":"IFERROR(VLOOKUP(B61,Entries!$A:$H,8,0),\"-\")","v":"-"},{"$f":"IFERROR(VLOOKUP(B61,Entries!$A:$F,6,0),\"-\")","v":"-"},null,null,null,3,305,{"$f":"IFERROR(VLOOKUP(K61,Entries!$A:$E,5,0),\"-\")","v":"Bucci"},{"$f":"IFERROR(VLOOKUP(K61,Entries!$A:$D,4,0),\"-\")","v":"Keiki"},{"$f":"IFERROR(VLOOKUP(K61,Entries!$A:$H,8,0),\"-\")","v":14},{"$f":"IFERROR(VLOOKUP(K61,Entries!$A:$F,6,0),\"-\")","v":"SS Athletics"},"4.25"]
[4,null,{"$f":"IFERROR(VLOOKUP(B62,Entries!$A:$E,5,0),\"-\")","v":"-"},{"$f":"IFERROR(VLOOKUP(B62,Entries!$A:$D,4,0),\"-\")","v":"-"},{"$f":"IFERROR(VLOOKUP(B62,Entries!$A:$H,8,0),\"-\")","v":"-"},{"$f":"IFERROR(VLOOKUP(B62,Entries!$A:$F,6,0),\"-\")","v":"-"},null,null,null,4,170,{"$f":"IFERROR(VLOOKUP(K62,Entries!$A:$E,5,0),\"-\")","v":"Turner"},{"$f":"IFERROR(VLOOKUP(K62,Entries!$A:$D,4,0),\"-\")","v":"Lola"},{"$f":"IFERROR(VLOOKUP(K62,Entries!$A:$H,8,0),\"-\")","v":13},{"$f":"IFERROR(VLOOKUP(K62,Entries!$A:$F,6,0),\"-\")","v":"SS Athletics"},"4.22"]
[5,null,{"$f":"IFERROR(VLOOKUP(B63,Entries!$A:$E,5,0),\"-\")","v":"-"},{"$f":"IFERROR(VLOOKUP(B63,Entries!$A:$D,4,0),\"-\")","v":"-"},{"$f":"IFERROR(VLOOKUP(B63,Entries!$A:$H,8,0),\"-\")","v":"-"},{"$f":"IFERROR(VLOOKUP(B63,Entries!$A:$F,6,0),\"-\")","v":"-"},null,null,null,5,207,{"$f":"IFERROR(VLOOKUP(K63,Entries!$A:$E,5,0),\"-\")","v":"McGowan"},{"$f":"IFERROR(VLOOKUP(K63,Entries!$A:$D,4,0),\"-\")","v":"Freya "},{"$f":"IFERROR(VLOOKUP(K63,Entries!$A:$H,8,0),\"-\")","v":13},{"$f":"IFERROR(VLOOKUP(K63,Entries!$A:$F,6,0),\"-\")","v":"Watford Harriers"},"4.18"]
[6,null,{"$f":"IFERROR(VLOOKUP(B64,Entries!$A:$E,5,0),\"-\")","v":"-"},{"$f":"IFERROR(VLOOKUP(B64,Entries!$A:$D,4,0),\"-\")","v":"-"},{"$f":"IFERROR(VLOOKUP(B64,Entries!$A:$H,8,0),\"-\")","v":"-"},{"$f":"IFERROR(VLOOKUP(B64,Entries!$A:$F,6,0),\"-\")","v":"-"},null,null,null,6,54,{"$f":"IFERROR(VLOOKUP(K64,Entries!$A:$E,5,0),\"-\")","v":"Rushworth"},{"$f":"IFERROR(VLOOKUP(K64,Entries!$A:$D,4,0),\"-\")","v":"Annalise"},{"$f":"IFERROR(VLOOKUP(K64,Entries!$A:$H,8,0),\"-\")","v":13},{"$f":"IFERROR(VLOOKUP(K64,Entries!$A:$F,6,0),\"-\")","v":"Windsor Slough Eton & Hounslow AC"},"4.03"]
[7,null,{"$f":"IFERROR(VLOOKUP(B65,Entries!$A:$E,5,0),\"-\")","v":"-"},{"$f":"IFERROR(VLOOKUP(B65,Entries!$A:$D,4,0),\"-\")","v":"-"},{"$f":"IFERROR(VLOOKUP(B65,Entries!$A:$H,8,0),\"-\")","v":"-"},{"$f":"IFERROR(VLOOKUP(B65,Entries!$A:$F,6,0),\"-\")","v":"-"},null,null,null,7,191,{"$f":"IFERROR(VLOOKUP(K65,Entries!$A:$E,5,0),\"-\")","v":"Moss"},{"$f":"IFERROR(VLOOKUP(K65,Entries!$A:$D,4,0),\"-\")","v":"Cherri"},{"$f":"IFERROR(VLOOKUP(K65,Entries!$A:$H,8,0),\"-\")","v":13},{"$f":"IFERROR(VLOOKUP(K65,Entries!$A:$F,6,0),\"-\")","v":"Chelmsford AC"},"3.90"]
[8,null,{"$f":"IFERROR(VLOOKUP(B66,Entries!$A:$E,5,0),\"-\")","v":"-"},{"$f":"IFERROR(VLOOKUP(B66,Entries!$A:$D,4,0),\"-\")","v":"-"},{"$f":"IFERROR(VLOOKUP(B66,Entries!$A:$H,8,0),\"-\")","v":"-"},{"$f":"IFERROR(VLOOKUP(B66,Entries!$A:$F,6,0),\"-\")","v":"-"},null,null,null,8,null,{"$f":"IFERROR(VLOOKUP(K66,Entries!$A:$E,5,0),\"-\")","v":"-"},{"$f":"IFERROR(VLOOKUP(K66,Entries!$A:$D,4,0),\"-\")","v":"-"},{"$f":"IFERROR(VLOOKUP(K66,Entries!$A:$H,8,0),\"-\")","v":"-"},{"$f":"IFERROR(VLOOKUP(K66,Entries!$A:$F,6,0),\"-\")","v":"-"}]
[9,null,{"$f":"IFERROR(VLOOKUP(B67,Entries!$A:$E,5,0),\"-\")","v":"-"},{"$f":"IFERROR(VLOOKUP(B67,Entries!$A:$D,4,0),\"-\")","v":"-"},{"$f":"IFERROR(VLOOKUP(B67,Entries!$A:$H,8,0),\"-\")","v":"-"},{"$f":"IFERROR(VLOOKUP(B67,Entries!$A:$F,6,0),\"-\")","v":"-"},null,null,null,9,null,{"$f":"IFERROR(VLOOKUP(K67,Entries!$A:$E,5,0),\"-\")","v":"-"},{"$f":"IFERROR(VLOOKUP(K67,Entries!$A:$D,4,0),\"-\")","v":"-"},{"$f":"IFERROR(VLOOKUP(K67,Entries!$A:$H,8,0),\"-\")","v":"-"},{"$f":"IFERROR(VLOOKUP(K67,Entries!$A:$F,6,0),\"-\")","v":"-"}]
[10,null,{"$f":"IFERROR(VLOOKUP(B68,Entries!$A:$E,5,0),\"-\")","v":"-"},{"$f":"IFERROR(VLOOKUP(B68,Entries!$A:$D,4,0),\"-\")","v":"-"},{"$f":"IFERROR(VLOOKUP(B68,Entries!$A:$H,8,0),\"-\")","v":"-"},{"$f":"IFERROR(VLOOKUP(B68,Entries!$A:$F,6,0),\"-\")","v":"-"},null,null,null,10,null,{"$f":"IFERROR(VLOOKUP(K68,Entries!$A:$E,5,0),\"-\")","v":"-"},{"$f":"IFERROR(VLOOKUP(K68,Entries!$A:$D,4,0),\"-\")","v":"-"},{"$f":"IFERROR(VLOOKUP(K68,Entries!$A:$H,8,0),\"-\")","v":"-"},{"$f":"IFERROR(VLOOKUP(K68,Entries!$A:$F,6,0),\"-\")","v":"-"}]
[]
[]
["U17 Men",null,null,null,null,null,null,null,null,"U17 Women"]
["Pos","Number","Last Name","First Name","Age","Club","Distance","Wind",null,"Pos","Number","Last Name","First Name","Age","Club","Distance","Wind"]
[1,344,{"$f":"IFERROR(VLOOKUP(B73,Entries!$A:$E,5,0),\"-\")","v":"Lee"},{"$f":"IFERROR(VLOOKUP(B73,Entries!$A:$D,4,0),\"-\")","v":"Harry"},{"$f":"IFERROR(VLOOKUP(B73,Entries!$A:$H,8,0),\"-\")","v":15},{"$f":"IFERROR(VLOOKUP(B73,Entries!$A:$F,6,0),\"-\")","v":"Chelmsford AC"},"5.92",null,null,1,337,{"$f":"IFERROR(VLOOKUP(K73,Entries!$A:$E,5,0),\"-\")","v":"Heath"},{"$f":"IFERROR(VLOOKUP(K73,Entries!$A:$D,4,0),\"-\")","v":"Jessica"},{"$f":"IFERROR(VLOOKUP(K73,Entries!$A:$H,8,0),\"-\")","v":16},{"$f":"IFERROR(VLOOKUP(K73,Entries!$A:$F,6,0),\"-\")","v":"Basildon AC"},"4.50"]
[2,null,{"$f":"IFERROR(VLOOKUP(B74,Entries!$A:$E,5,0),\"-\")","v":"-"},{"$f":"IFERROR(VLOOKUP(B74,Entries!$A:$D,4,0),\"-\")","v":"-"},{"$f":"IFERROR(VLOOKUP(B74,Entries!$A:$H,8,0),\"-\")","v":"-"},{"$f":"IFERROR(VLOOKUP(B74,Entries!$A:$F,6,0),\"-\")","v":"-"},null,null,null,2,null,{"$f":"IFERROR(VLOOKUP(K74,Entries!$A:$E,5,0),\"-\")","v":"-"},{"$f":"IFERROR(VLOOKUP(K74,Entries!$A:$D,4,0),\"-\")","v":"-"},{"$f":"IFERROR(VLOOKUP(K74,Entries!$A:$H,8,0),\"-\")","v":"-"},{"$f":"IFERROR(VLOOKUP(K74,Entries!$A:$F,6,0),\"-\")","v":"-"}]
[3,null,{"$f":"IFERROR(VLOOKUP(B75,Entries!$A:$E,5,0),\"-\")","v":"-"},{"$f":"IFERROR(VLOOKUP(B75,Entries!$A:$D,4,0),\"-\")","v":"-"},{"$f":"IFERROR(VLOOKUP(B75,Entries!$A:$H,8,0),\"-\")","v":"-"},{"$f":"IFERROR(VLOOKUP(B75,Entries!$A:$F,6,0),\"-\")","v":"-"},null,null,null,3,null,{"$f":"IFERROR(VLOOKUP(K75,Entries!$A:$E,5,0),\"-\")","v":"-"},{"$f":"IFERROR(VLOOKUP(K75,Entries!$A:$D,4,0),\"-\")","v":"-"},{"$f":"IFERROR(VLOOKUP(K75,Entries!$A:$H,8,0),\"-\")","v":"-"},{"$f":"IFERROR(VLOOKUP(K75,Entries!$A:$F,6,0),\"-\")","v":"-"}]
[4,null,{"$f":"IFERROR(VLOOKUP(B76,Entries!$A:$E,5,0),\"-\")","v":"-"},{"$f":"IFERROR(VLOOKUP(B76,Entries!$A:$D,4,0),\"-\")","v":"-"},{"$f":"IFERROR(VLOOKUP(B76,Entries!$A:$H,8,0),\"-\")","v":"-"},{"$f":"IFERROR(VLOOKUP(B76,Entries!$A:$F,6,0),\"-\")","v":"-"},null,null,null,4,null,{"$f":"IFERROR(VLOOKUP(K76,Entries!$A:$E,5,0),\"-\")","v":"-"},{"$f":"IFERROR(VLOOKUP(K76,Entries!$A:$D,4,0),\"-\")","v":"-"},{"$f":"IFERROR(VLOOKUP(K76,Entries!$A:$H,8,0),\"-\")","v":"-"},{"$f":"IFERROR(VLOOKUP(K76,Entries!$A:$F,6,0),\"-\")","v":"-"}]
[5,null,{"$f":"IFERROR(VLOOKUP(B77,Entries!$A:$E,5,0),\"-\")","v":"-"},{"$f":"IFERROR(VLOOKUP(B77,Entries!$A:$D,4,0),\"-\")","v":"-"},{"$f":"IFERROR(VLOOKUP(B77,Entries!$A:$H,8,0),\"-\")","v":"-"},{"$f":"IFERROR(VLOOKUP(B77,Entries!$A:$F,6,0),\"-\")","v":"-"},null,null,null,5,null,{"$f":"IFERROR(VLOOKUP(K77,Entries!$A:$E,5,0),\"-\")","v":"-"},{"$f":"IFERROR(VLOOKUP(K77,Entries!$A:$D,4,0),\"-\")","v":"-"},{"$f":"IFERROR(VLOOKUP(K77,Entries!$A:$H,8,0),\"-\")","v":"-"},{"$f":"IFERROR(VLOOKUP(K77,Entries!$A:$F,6,0),\"-\")","v":"-"}]
[6,null,{"$f":"IFERROR(VLOOKUP(B78,Entries!$A:$E,5,0),\"-\")","v":"-"},{"$f":"IFERROR(VLOOKUP(B78,Entries!$A:$D,4,0),\"-\")","v":"-"},{"$f":"IFERROR(VLOOKUP(B78,Entries!$A:$H,8,0),\"-\")","v":"-"},{"$f":"IFERROR(VLOOKUP(B78,Entries!$A:$F,6,0),\"-\")","v":"-"},null,null,null,6,null,{"$f":"IFERROR(VLOOKUP(K78,Entries!$A:$E,5,0),\"-\")","v":"-"},{"$f":"IFERROR(VLOOKUP(K78,Entries!$A:$D,4,0),\"-\")","v":"-"},{"$f":"IFERROR(VLOOKUP(K78,Entries!$A:$H,8,0),\"-\")","v":"-"},{"$f":"IFERROR(VLOOKUP(K78,Entries!$A:$F,6,0),\"-\")","v":"-"}]
[7,null,{"$f":"IFERROR(VLOOKUP(B79,Entries!$A:$E,5,0),\"-\")","v":"-"},{"$f":"IFERROR(VLOOKUP(B79,Entries!$A:$D,4,0),\"-\")","v":"-"},{"$f":"IFERROR(VLOOKUP(B79,Entries!$A:$H,8,0),\"-\")","v":"-"},{"$f":"IFERROR(VLOOKUP(B79,Entries!$A:$F,6,0),\"-\")","v":"-"},null,null,null,7,null,{"$f":"IFERROR(VLOOKUP(K79,Entries!$A:$E,5,0),\"-\")","v":"-"},{"$f":"IFERROR(VLOOKUP(K79,Entries!$A:$D,4,0),\"-\")","v":"-"},{"$f":"IFERROR(VLOOKUP(K79,Entries!$A:$H,8,0),\"-\")","v":"-"},{"$f":"IFERROR(VLOOKUP(K79,Entries!$A:$F,6,0),\"-\")","v":"-"}]
[8,null,{"$f":"IFERROR(VLOOKUP(B80,Entries!$A:$E,5,0),\"-\")","v":"-"},{"$f":"IFERROR(VLOOKUP(B80,Entries!$A:$D,4,0),\"-\")","v":"-"},{"$f":"IFERROR(VLOOKUP(B80,Entries!$A:$H,8,0),\"-\")","v":"-"},{"$f":"IFERROR(VLOOKUP(B80,Entries!$A:$F,6,0),\"-\")","v":"-"},null,null,null,8,null,{"$f":"IFERROR(VLOOKUP(K80,Entries!$A:$E,5,0),\"-\")","v":"-"},{"$f":"IFERROR(VLOOKUP(K80,Entries!$A:$D,4,0),\"-\")","v":"-"},{"$f":"IFERROR(VLOOKUP(K80,Entries!$A:$H,8,0),\"-\")","v":"-"},{"$f":"IFERROR(VLOOKUP(K80,Entries!$A:$F,6,0),\"-\")","v":"-"}]
[9,null,{"$f":"IFERROR(VLOOKUP(B81,Entries!$A:$E,5,0),\"-\")","v":"-"},{"$f":"IFERROR(VLOOKUP(B81,Entries!$A:$D,4,0),\"-\")","v":"-"},{"$f":"IFERROR(VLOOKUP(B81,Entries!$A:$H,8,0),\"-\")","v":"-"},{"$f":"IFERROR(VLOOKUP(B81,Entries!$A:$F,6,0),\"-\")","v":"-"},null,null,null,9,null,{"$f":"IFERROR(VLOOKUP(K81,Entries!$A:$E,5,0),\"-\")","v":"-"},{"$f":"IFERROR(VLOOKUP(K81,Entries!$A:$D,4,0),\"-\")","v":"-"},{"$f":"IFERROR(VLOOKUP(K81,Entries!$A:$H,8,0),\"-\")","v":"-"},{"$f":"IFERROR(VLOOKUP(K81,Entries!$A:$F,6,0),\"-\")","v":"-"}]
[10,null,{"$f":"IFERROR(VLOOKUP(B82,Entries!$A:$E,5,0),\"-\")","v":"-"},{"$f":"IFERROR(VLOOKUP(B82,Entries!$A:$D,4,0),\"-\")","v":"-"},{"$f":"IFERROR(VLOOKUP(B82,Entries!$A:$H,8,0),\"-\")","v":"-"},{"$f":"IFERROR(VLOOKUP(B82,Entries!$A:$F,6,0),\"-\")","v":"-"},null,null,null,10,null,{"$f":"IFERROR(VLOOKUP(K82,Entries!$A:$E,5,0),\"-\")","v":"-"},{"$f":"IFERROR(VLOOKUP(K82,Entries!$A:$D,4,0),\"-\")","v":"-"},{"$f":"IFERROR(VLOOKUP(K82,Entries!$A:$H,8,0),\"-\")","v":"-"},{"$f":"IFERROR(VLOOKUP(K82,Entries!$A:$F,6,0),\"-\")","v":"-"}]
[]
[]
["Senior Men"]
["Pos","Number","Last Name","First Name","Age","Club","Distance","Wind"]
[1,197,{"$f":"IFERROR(VLOOKUP(B87,Entries!$A:$E,5,0),\"-\")","v":"Casey"},{"$f":"IFERROR(VLOOKUP(B87,Entries!$A:$D,4,0),\"-\")","v":"James"},{"$f":"IFERROR(VLOOKUP(B87,Entries!$A:$H,8,0),\"-\")","v":21},{"$f":"IFERROR(VLOOKUP(B87,Entries!$A:$F,6,0),\"-\")","v":"Unattached"},"4.31"]
[2,279,{"$f":"IFERROR(VLOOKUP(B88,Entries!$A:$E,5,0),\"-\")","v":"Young"},{"$f":"IFERROR(VLOOKUP(B88,Entries!$A:$D,4,0),\"-\")","v":"Jake"},{"$f":"IFERROR(VLOOKUP(B88,Entries!$A:$H,8,0),\"-\")","v":34},{"$f":"IFERROR(VLOOKUP(B88,Entries!$A:$F,6,0),\"-\")","v":"SS Athletics"},"3.91"]
[3,null,{"$f":"IFERROR(VLOOKUP(B89,Entries!$A:$E,5,0),\"-\")","v":"-"},{"$f":"IFERROR(VLOOKUP(B89,Entries!$A:$D,4,0),\"-\")","v":"-"},{"$f":"IFERROR(VLOOKUP(B89,Entries!$A:$H,8,0),\"-\")","v":"-"},{"$f":"IFERROR(VLOOKUP(B89,Entries!$A:$F,6,0),\"-\")","v":"-"}]
[4,null,{"$f":"IFERROR(VLOOKUP(B90,Entries!$A:$E,5,0),\"-\")","v":"-"},{"$f":"IFERROR(VLOOKUP(B90,Entries!$A:$D,4,0),\"-\")","v":"-"},{"$f":"IFERROR(VLOOKUP(B90,Entries!$A:$H,8,0),\"-\")","v":"-"},{"$f":"IFERROR(VLOOKUP(B90,Entries!$A:$F,6,0),\"-\")","v":"-"}]
[5,null,{"$f":"IFERROR(VLOOKUP(B91,Entries!$A:$E,5,0),\"-\")","v":"-"},{"$f":"IFERROR(VLOOKUP(B91,Entries!$A:$D,4,0),\"-\")","v":"-"},{"$f":"IFERROR(VLOOKUP(B91,Entries!$A:$H,8,0),\"-\")","v":"-"},{"$f":"IFERROR(VLOOKUP(B91,Entries!$A:$F,6,0),\"-\")","v":"-"}]
[6,null,{"$f":"IFERROR(VLOOKUP(B92,Entries!$A:$E,5,0),\"-\")","v":"-"},{"$f":"IFERROR(VLOOKUP(B92,Entries!$A:$D,4,0),\"-\")","v":"-"},{"$f":"IFERROR(VLOOKUP(B92,Entries!$A:$H,8,0),\"-\")","v":"-"},{"$f":"IFERROR(VLOOKUP(B92,Entries!$A:$F,6,0),\"-\")","v":"-"}]
[7,null,{"$f":"IFERROR(VLOOKUP(B93,Entries!$A:$E,5,0),\"-\")","v":"-"},{"$f":"IFERROR(VLOOKUP(B93,Entries!$A:$D,4,0),\"-\")","v":"-"},{"$f":"IFERROR(VLOOKUP(B93,Entries!$A:$H,8,0),\"-\")","v":"-"},{"$f":"IFERROR(VLOOKUP(B93,Entries!$A:$F,6,0),\"-\")","v":"-"}]
[8,null,{"$f":"IFERROR(VLOOKUP(B94,Entries!$A:$E,5,0),\"-\")","v":"-"},{"$f":"IFERROR(VLOOKUP(B94,Entries!$A:$D,4,0),\"-\")","v":"-"},{"$f":"IFERROR(VLOOKUP(B94,Entries!$A:$H,8,0),\"-\")","v":"-"},{"$f":"IFERROR(VLOOKUP(B94,Entries!$A:$F,6,0),\"-\")","v":"-"}]
[9,null,{"$f":"IFERROR(VLOOKUP(B95,Entries!$A:$E,5,0),\"-\")","v":"-"},{"$f":"IFERROR(VLOOKUP(B95,Entries!$A:$D,4,0),\"-\")","v":"-"},{"$f":"IFERROR(VLOOKUP(B95,Entries!$A:$H,8,0),\"-\")","v":"-"},{"$f":"IFERROR(VLOOKUP(B95,Entries!$A:$F,6,0),\"-\")","v":"-"}]
[10,null,{"$f":"IFERROR(VLOOKUP(B96,Entries!$A:$E,5,0),\"-\")","v":"-"},{"$f":"IFERROR(VLOOKUP(B96,Entries!$A:$D,4,0),\"-\")","v":"-"},{"$f":"IFERROR(VLOOKUP(B96,Entries!$A:$H,8,0),\"-\")","v":"-"},{"$f":"IFERROR(VLOOKUP(B96,Entries!$A:$F,6,0),\"-\")","v":"-"}]
[]
[]
["Veteran Men",null,null,null,null,null,null,null,null,"Veteran Women"]
["Pos","Number","Last Name","First Name","Age","Club","Distance","Wind",null,"Pos","Number","Last Name","First Name","Age","Club","Distance","Wind"]
[1,210,{"$f":"IFERROR(VLOOKUP(B101,Entries!$A:$E,5,0),\"-\")","v":"Maskell"},{"$f":"IFERROR(VLOOKUP(B101,Entries!$A:$D,4,0),\"-\")","v":"Richard"},{"$f":"IFERROR(VLOOKUP(B101,Entries!$A:$H,8,0),\"-\")","v":48},{"$f":"IFERROR(VLOOKUP(B101,Entries!$A:$F,6,0),\"-\")","v":"City of Southend-on-Sea Athletic Club"},"4.17",null,null,1,345,{"$f":"IFERROR(VLOOKUP(K101,Entries!$A:$E,5,0),\"-\")","v":"Donnelly"},{"$f":"IFERROR(VLOOKUP(K101,Entries!$A:$D,4,0),\"-\")","v":"Linda"},{"$f":"IFERROR(VLOOKUP(K101,Entries!$A:$H,8,0),\"-\")","v":66},{"$f":"IFERROR(VLOOKUP(K101,Entries!$A:$F,6,0),\"-\")","v":"City of Southend On Sea AC"},"2.34"]
[2,null,{"$f":"IFERROR(VLOOKUP(B102,Entries!$A:$E,5,0),\"-\")","v":"-"},{"$f":"IFERROR(VLOOKUP(B102,Entries!$A:$D,4,0),\"-\")","v":"-"},{"$f":"IFERROR(VLOOKUP(B102,Entries!$A:$H,8,0),\"-\")","v":"-"},{"$f":"IFERROR(VLOOKUP(B102,Entries!$A:$F,6,0),\"-\")","v":"-"},null,null,null,2,295,{"$f":"IFERROR(VLOOKUP(K102,Entries!$A:$E,5,0),\"-\")","v":"Matthews-Smith"},{"$f":"IFERROR(VLOOKUP(K102,Entries!$A:$D,4,0),\"-\")","v":"Marion"},{"$f":"IFERROR(VLOOKUP(K102,Entries!$A:$H,8,0),\"-\")","v":69},{"$f":"IFERROR(VLOOKUP(K102,Entries!$A:$F,6,0),\"-\")","v":"City of Southend On Sea AC"},"2.07"]
[3,null,{"$f":"IFERROR(VLOOKUP(B103,Entries!$A:$E,5,0),\"-\")","v":"-"},{"$f":"IFERROR(VLOOKUP(B103,Entries!$A:$D,4,0),\"-\")","v":"-"},{"$f":"IFERROR(VLOOKUP(B103,Entries!$A:$H,8,0),\"-\")","v":"-"},{"$f":"IFERROR(VLOOKUP(B103,Entries!$A:$F,6,0),\"-\")","v":"-"},null,null,null,3,null,{"$f":"IFERROR(VLOOKUP(K103,Entries!$A:$E,5,0),\"-\")","v":"-"},{"$f":"IFERROR(VLOOKUP(K103,Entries!$A:$D,4,0),\"-\")","v":"-"},{"$f":"IFERROR(VLOOKUP(K103,Entries!$A:$H,8,0),\"-\")","v":"-"},{"$f":"IFERROR(VLOOKUP(K103,Entries!$A:$F,6,0),\"-\")","v":"-"}]
[4,null,{"$f":"IFERROR(VLOOKUP(B104,Entries!$A:$E,5,0),\"-\")","v":"-"},{"$f":"IFERROR(VLOOKUP(B104,Entries!$A:$D,4,0),\"-\")","v":"-"},{"$f":"IFERROR(VLOOKUP(B104,Entries!$A:$H,8,0),\"-\")","v":"-"},{"$f":"IFERROR(VLOOKUP(B104,Entries!$A:$F,6,0),\"-\")","v":"-"},null,null,null,4,null,{"$f":"IFERROR(VLOOKUP(K104,Entries!$A:$E,5,0),\"-\")","v":"-"},{"$f":"IFERROR(VLOOKUP(K104,Entries!$A:$D,4,0),\"-\")","v":"-"},{"$f":"IFERROR(VLOOKUP(K104,Entries!$A:$H,8,0),\"-\")","v":"-"},{"$f":"IFERROR(VLOOKUP(K104,Entries!$A:$F,6,0),\"-\")","v":"-"}]
[5,null,{"$f":"IFERROR(VLOOKUP(B105,Entries!$A:$E,5,0),\"-\")","v":"-"},{"$f":"IFERROR(VLOOKUP(B105,Entries!$A:$D,4,0),\"-\")","v":"-"},{"$f":"IFERROR(VLOOKUP(B105,Entries!$A:$H,8,0),\"-\")","v":"-"},{"$f":"IFERROR(VLOOKUP(B105,Entries!$A:$F,6,0),\"-\")","v":"-"},null,null,null,5,null,{"$f":"IFERROR(VLOOKUP(K105,Entries!$A:$E,5,0),\"-\")","v":"-"},{"$f":"IFERROR(VLOOKUP(K105,Entries!$A:$D,4,0),\"-\")","v":"-"},{"$f":"IFERROR(VLOOKUP(K105,Entries!$A:$H,8,0),\"-\")","v":"-"},{"$f":"IFERROR(VLOOKUP(K105,Entries!$A:$F,6,0),\"-\")","v":"-"}]
[6,null,{"$f":"IFERROR(VLOOKUP(B106,Entries!$A:$E,5,0),\"-\")","v":"-"},{"$f":"IFERROR(VLOOKUP(B106,Entries!$A:$D,4,0),\"-\")","v":"-"},{"$f":"IFERROR(VLOOKUP(B106,Entries!$A:$H,8,0),\"-\")","v":"-"},{"$f":"IFERROR(VLOOKUP(B106,Entries!$A:$F,6,0),\"-\")","v":"-"},null,null,null,6,null,{"$f":"IFERROR(VLOOKUP(K106,Entries!$A:$E,5,0),\"-\")","v":"-"},{"$f":"IFERROR(VLOOKUP(K106,Entries!$A:$D,4,0),\"-\")","v":"-"},{"$f":"IFERROR(VLOOKUP(K106,Entries!$A:$H,8,0),\"-\")","v":"-"},{"$f":"IFERROR(VLOOKUP(K106,Entries!$A:$F,6,0),\"-\")","v":"-"}]
[7,null,{"$f":"IFERROR(VLOOKUP(B107,Entries!$A:$E,5,0),\"-\")","v":"-"},{"$f":"IFERROR(VLOOKUP(B107,Entries!$A:$D,4,0),\"-\")","v":"-"},{"$f":"IFERROR(VLOOKUP(B107,Entries!$A:$H,8,0),\"-\")","v":"-"},{"$f":"IFERROR(VLOOKUP(B107,Entries!$A:$F,6,0),\"-\")","v":"-"},null,null,null,7,null,{"$f":"IFERROR(VLOOKUP(K107,Entries!$A:$E,5,0),\"-\")","v":"-"},{"$f":"IFERROR(VLOOKUP(K107,Entries!$A:$D,4,0),\"-\")","v":"-"},{"$f":"IFERROR(VLOOKUP(K107,Entries!$A:$H,8,0),\"-\")","v":"-"},{"$f":"IFERROR(VLOOKUP(K107,Entries!$A:$F,6,0),\"-\")","v":"-"}]
[8,null,{"$f":"IFERROR(VLOOKUP(B108,Entries!$A:$E,5,0),\"-\")","v":"-"},{"$f":"IFERROR(VLOOKUP(B108,Entries!$A:$D,4,0),\"-\")","v":"-"},{"$f":"IFERROR(VLOOKUP(B108,Entries!$A:$H,8,0),\"-\")","v":"-"},{"$f":"IFERROR(VLOOKUP(B108,Entries!$A:$F,6,0),\"-\")","v":"-"},null,null,null,8,null,{"$f":"IFERROR(VLOOKUP(K108,Entries!$A:$E,5,0),\"-\")","v":"-"},{"$f":"IFERROR(VLOOKUP(K108,Entries!$A:$D,4,0),\"-\")","v":"-"},{"$f":"IFERROR(VLOOKUP(K108,Entries!$A:$H,8,0),\"-\")","v":"-"},{"$f":"IFERROR(VLOOKUP(K108,Entries!$A:$F,6,0),\"-\")","v":"-"}]
[9,null,{"$f":"IFERROR(VLOOKUP(B109,Entries!$A:$E,5,0),\"-\")","v":"-"},{"$f":"IFERROR(VLOOKUP(B109,Entries!$A:$D,4,0),\"-\")","v":"-"},{"$f":"IFERROR(VLOOKUP(B109,Entries!$A:$H,8,0),\"-\")","v":"-"},{"$f":"IFERROR(VLOOKUP(B109,Entries!$A:$F,6,0),\"-\")","v":"-"},null,null,null,9,null,{"$f":"IFERROR(VLOOKUP(K109,Entries!$A:$E,5,0),\"-\")","v":"-"},{"$f":"IFERROR(VLOOKUP(K109,Entries!$A:$D,4,0),\"-\")","v":"-"},{"$f":"IFERROR(VLOOKUP(K109,Entries!$A:$H,8,0),\"-\")","v":"-"},{"$f":"IFERROR(VLOOKUP(K109,Entries!$A:$F,6,0),\"-\")","v":"-"}]
[10,null,{"$f":"IFERROR(VLOOKUP(B110,Entries!$A:$E,5,0),\"-\")","v":"-"},{"$f":"IFERROR(VLOOKUP(B110,Entries!$A:$D,4,0),\"-\")","v":"-"},{"$f":"IFERROR(VLOOKUP(B110,Entries!$A:$H,8,0),\"-\")","v":"-"},{"$f":"IFERROR(VLOOKUP(B110,Entries!$A:$F,6,0),\"-\")","v":"-"},null,null,null,10,null,{"$f":"IFERROR(VLOOKUP(K110,Entries!$A:$E,5,0),\"-\")","v":"-"},{"$f":"IFERROR(VLOOKUP(K110,Entries!$A:$D,4,0),\"-\")","v":"-"},{"$f":"IFERROR(VLOOKUP(K110,Entries!$A:$H,8,0),\"-\")","v":"-"},{"$f":"IFERROR(VLOOKUP(K110,Entries!$A:$F,6,0),\"-\")","v":"-"}]

{"sheet":"Shot Putt","index":16,"n_rows":84,"n_cols":15,"rows_kept":84,"cut":false,"hidden":false,"merged":[]}
["Shot Putt"]
[]
[null,null,null,null,null,null,null,null,"U13 Girls"]
[null,null,null,null,null,null,null,null,"Pos","Number","Last Name","First Name","Age","Club","Distance"]
[null,null,null,null,null,null,null,null,1,154,{"$f":"IFERROR(VLOOKUP(J5,Entries!$A:$E,5,0),\"-\")","v":"Osei"},{"$f":"IFERROR(VLOOKUP(J5,Entries!$A:$D,4,0),\"-\")","v":"Oluwatimileyin Elizabeth"},{"$f":"IFERROR(VLOOKUP(J5,Entries!$A:$H,8,0),\"-\")","v":12},{"$f":"IFERROR(VLOOKUP(J5,Entries!$A:$F,6,0),\"-\")","v":"Chelmsford AC"},"8.42"]
[null,null,null,null,null,null,null,null,2,77,{"$f":"IFERROR(VLOOKUP(J6,Entries!$A:$E,5,0),\"-\")","v":"Oladele"},{"$f":"IFERROR(VLOOKUP(J6,Entries!$A:$D,4,0),\"-\")","v":"Davina"},{"$f":"IFERROR(VLOOKUP(J6,Entries!$A:$H,8,0),\"-\")","v":11},{"$f":"IFERROR(VLOOKUP(J6,Entries!$A:$F,6,0),\"-\")","v":"Thurrock Harriers"},"8.39"]
[null,null,null,null,null,null,null,null,3,216,{"$f":"IFERROR(VLOOKUP(J7,Entries!$A:$E,5,0),\"-\")","v":"Arnold"},{"$f":"IFERROR(VLOOKUP(J7,Entries!$A:$D,4,0),\"-\")","v":"Jessica"},{"$f":"IFERROR(VLOOKUP(J7,Entries!$A:$H,8,0),\"-\")","v":12},{"$f":"IFERROR(VLOOKUP(J7,Entries!$A:$F,6,0),\"-\")","v":"Brentwood Beagles Athletics Club"},"6.46"]
[null,null,null,null,null,null,null,null,4,1,{"$f":"IFERROR(VLOOKUP(J8,Entries!$A:$E,5,0),\"-\")","v":"Awoyode"},{"$f":"IFERROR(VLOOKUP(J8,Entries!$A:$D,4,0),\"-\")","v":"Maria Oreoluwa"},{"$f":"IFERROR(VLOOKUP(J8,Entries!$A:$H,8,0),\"-\")","v":11},{"$f":"IFERROR(VLOOKUP(J8,Entries!$A:$F,6,0),\"-\")","v":"Aldershot Farnham & District"},"5.77"]
[null,null,null,null,null,null,null,null,5,192,{"$f":"IFERROR(VLOOKUP(J9,Entries!$A:$E,5,0),\"-\")","v":"Moss"},{"$f":"IFERROR(VLOOKUP(J9,Entries!$A:$D,4,0),\"-\")","v":"Maddie"},{"$f":"IFERROR(VLOOKUP(J9,Entries!$A:$H,8,0),\"-\")","v":12},{"$f":"IFERROR(VLOOKUP(J9,Entries!$A:$F,6,0),\"-\")","v":"Chelmsford AC"},"5.31"]
[null,null,null,null,null,null,null,null,6,299,{"$f":"IFERROR(VLOOKUP(J10,Entries!$A:$E,5,0),\"-\")","v":"Palmer-Traer"},{"$f":"IFERROR(VLOOKUP(J10,Entries!$A:$D,4,0),\"-\")","v":"Ella"},{"$f":"IFERROR(VLOOKUP(J10,Entries!$A:$H,8,0),\"-\")","v":11},{"$f":"IFERROR(VLOOKUP(J10,Entries!$A:$F,6,0),\"-\")","v":"City of Southend On Sea AC"},"4.30"]
[null,null,null,null,null,null,null,null,7,26,{"$f":"IFERROR(VLOOKUP(J11,Entries!$A:$E,5,0),\"-\")","v":"Rolfe"},{"$f":"IFERROR(VLOOKUP(J11,Entries!$A:$D,4,0),\"-\")","v":"Poppy"},{"$f":"IFERROR(VLOOKUP(J11,Entries!$A:$H,8,0),\"-\")","v":12},{"$f":"IFERROR(VLOOKUP(J11,Entries!$A:$F,6,0),\"-\")","v":"SS Athletics"},"4.24"]
[null,null,null,null,null,null,null,null,8,null,{"$f":"IFERROR(VLOOKUP(J12,Entries!$A:$E,5,0),\"-\")","v":"-"},{"$f":"IFERROR(VLOOKUP(J12,Entries!$A:$D,4,0),\"-\")","v":"-"},{"$f":"IFERROR(VLOOKUP(J12,Entries!$A:$H,8,0),\"-\")","v":"-"},{"$f":"IFERROR(VLOOKUP(J12,Entries!$A:$F,6,0),\"-\")","v":"-"}]
[null,null,null,null,null,null,null,null,9,null,{"$f":"IFERROR(VLOOKUP(J13,Entries!$A:$E,5,0),\"-\")","v":"-"},{"$f":"IFERROR(VLOOKUP(J13,Entries!$A:$D,4,0),\"-\")","v":"-"},{"$f":"IFERROR(VLOOKUP(J13,Entries!$A:$H,8,0),\"-\")","v":"-"},{"$f":"IFERROR(VLOOKUP(J13,Entries!$A:$F,6,0),\"-\")","v":"-"}]
[null,null,null,null,null,null,null,null,10,null,{"$f":"IFERROR(VLOOKUP(J14,Entries!$A:$E,5,0),\"-\")","v":"-"},{"$f":"IFERROR(VLOOKUP(J14,Entries!$A:$D,4,0),\"-\")","v":"-"},{"$f":"IFERROR(VLOOKUP(J14,Entries!$A:$H,8,0),\"-\")","v":"-"},{"$f":"IFERROR(VLOOKUP(J14,Entries!$A:$F,6,0),\"-\")","v":"-"}]
[]
[]
["U15 Boys",null,null,null,null,null,null,null,"U15 Girls"]
["Pos","Number","Last Name","First Name","Age","Club","Distance",null,"Pos","Number","Last Name","First Name","Age","Club","Distance"]
[1,250,{"$f":"IFERROR(VLOOKUP(B19,Entries!$A:$E,5,0),\"-\")","v":"Weston"},{"$f":"IFERROR(VLOOKUP(B19,Entries!$A:$D,4,0),\"-\")","v":"Jack"},{"$f":"IFERROR(VLOOKUP(B19,Entries!$A:$H,8,0),\"-\")","v":14},{"$f":"IFERROR(VLOOKUP(B19,Entries!$A:$F,6,0),\"-\")","v":"Basildon AC"},"9.55",null,1,246,{"$f":"IFERROR(VLOOKUP(J19,Entries!$A:$E,5,0),\"-\")","v":"Malagala"},{"$f":"IFERROR(VLOOKUP(J19,Entries!$A:$D,4,0),\"-\")","v":"Monica"},{"$f":"IFERROR(VLOOKUP(J19,Entries!$A:$H,8,0),\"-\")","v":14},{"$f":"IFERROR(VLOOKUP(J19,Entries!$A:$F,6,0),\"-\")","v":"Chelmsford AC"},"12.66"]
[2,null,{"$f":"IFERROR(VLOOKUP(B20,Entries!$A:$E,5,0),\"-\")","v":"-"},{"$f":"IFERROR(VLOOKUP(B20,Entries!$A:$D,4,0),\"-\")","v":"-"},{"$f":"IFERROR(VLOOKUP(B20,Entries!$A:$H,8,0),\"-\")","v":"-"},{"$f":"IFERROR(VLOOKUP(B20,Entries!$A:$F,6,0),\"-\")","v":"-"},null,null,2,230,{"$f":"IFERROR(VLOOKUP(J20,Entries!$A:$E,5,0),\"-\")","v":"Hartman"},{"$f":"IFERROR(VLOOKUP(J20,Entries!$A:$D,4,0),\"-\")","v":"Lily"},{"$f":"IFERROR(VLOOKUP(J20,Entries!$A:$H,8,0),\"-\")","v":14},{"$f":"IFERROR(VLOOKUP(J20,Entries!$A:$F,6,0),\"-\")","v":"Basildon AC"},"8.97"]
[3,null,{"$f":"IFERROR(VLOOKUP(B21,Entries!$A:$E,5,0),\"-\")","v":"-"},{"$f":"IFERROR(VLOOKUP(B21,Entries!$A:$D,4,0),\"-\")","v":"-"},{"$f":"IFERROR(VLOOKUP(B21,Entries!$A:$H,8,0),\"-\")","v":"-"},{"$f":"IFERROR(VLOOKUP(B21,Entries!$A:$F,6,0),\"-\")","v":"-"},null,null,3,18,{"$f":"IFERROR(VLOOKUP(J21,Entries!$A:$E,5,0),\"-\")","v":"Makepeace"},{"$f":"IFERROR(VLOOKUP(J21,Entries!$A:$D,4,0),\"-\")","v":"Stevie"},{"$f":"IFERROR(VLOOKUP(J21,Entries!$A:$H,8,0),\"-\")","v":13},{"$f":"IFERROR(VLOOKUP(J21,Entries!$A:$F,6,0),\"-\")","v":"City of Southend On Sea AC"},"7.76"]
[4,null,{"$f":"IFERROR(VLOOKUP(B22,Entries!$A:$E,5,0),\"-\")","v":"-"},{"$f":"IFERROR(VLOOKUP(B22,Entries!$A:$D,4,0),\"-\")","v":"-"},{"$f":"IFERROR(VLOOKUP(B22,Entries!$A:$H,8,0),\"-\")","v":"-"},{"$f":"IFERROR(VLOOKUP(B22,Entries!$A:$F,6,0),\"-\")","v":"-"},null,null,4,39,{"$f":"IFERROR(VLOOKUP(J22,Entries!$A:$E,5,0),\"-\")","v":"Angeli"},{"$f":"IFERROR(VLOOKUP(J22,Entries!$A:$D,4,0),\"-\")","v":"Eleanor"},{"$f":"IFERROR(VLOOKUP(J22,Entries!$A:$H,8,0),\"-\")","v":14},{"$f":"IFERROR(VLOOKUP(J22,Entries!$A:$F,6,0),\"-\")","v":"Brentwood Beagles Athletics Club"},"6.89"]
[5,null,{"$f":"IFERROR(VLOOKUP(B23,Entries!$A:$E,5,0),\"-\")","v":"-"},{"$f":"IFERROR(VLOOKUP(B23,Entries!$A:$D,4,0),\"-\")","v":"-"},{"$f":"IFERROR(VLOOKUP(B23,Entries!$A:$H,8,0),\"-\")","v":"-"},{"$f":"IFERROR(VLOOKUP(B23,Entries!$A:$F,6,0),\"-\")","v":"-"},null,null,5,305,{"$f":"IFERROR(VLOOKUP(J23,Entries!$A:$E,5,0),\"-\")","v":"Bucci"},{"$f":"IFERROR(VLOOKUP(J23,Entries!$A:$D,4,0),\"-\")","v":"Keiki"},{"$f":"IFERROR(VLOOKUP(J23,Entries!$A:$H,8,0),\"-\")","v":14},{"$f":"IFERROR(VLOOKUP(J23,Entries!$A:$F,6,0),\"-\")","v":"SS Athletics"},"6.76"]
[6,null,{"$f":"IFERROR(VLOOKUP(B24,Entries!$A:$E,5,0),\"-\")","v":"-"},{"$f":"IFERROR(VLOOKUP(B24,Entries!$A:$D,4,0),\"-\")","v":"-"},{"$f":"IFERROR(VLOOKUP(B24,Entries!$A:$H,8,0),\"-\")","v":"-"},{"$f":"IFERROR(VLOOKUP(B24,Entries!$A:$F,6,0),\"-\")","v":"-"},null,null,6,198,{"$f":"IFERROR(VLOOKUP(J24,Entries!$A:$E,5,0),\"-\")","v":"Hawkins"},{"$f":"IFERROR(VLOOKUP(J24,Entries!$A:$D,4,0),\"-\")","v":"Katie"},{"$f":"IFERROR(VLOOKUP(J24,Entries!$A:$H,8,0),\"-\")","v":14},{"$f":"IFERROR(VLOOKUP(J24,Entries!$A:$F,6,0),\"-\")","v":"Brentwood Beagles Athletics Club"},"6.66"]
[7,null,{"$f":"IFERROR(VLOOKUP(B25,Entries!$A:$E,5,0),\"-\")","v":"-"},{"$f":"IFERROR(VLOOKUP(B25,Entries!$A:$D,4,0),\"-\")","v":"-"},{"$f":"IFERROR(VLOOKUP(B25,Entries!$A:$H,8,0),\"-\")","v":"-"},{"$f":"IFERROR(VLOOKUP(B25,Entries!$A:$F,6,0),\"-\")","v":"-"},null,null,7,173,{"$f":"IFERROR(VLOOKUP(J25,Entries!$A:$E,5,0),\"-\")","v":"Marshment"},{"$f":"IFERROR(VLOOKUP(J25,Entries!$A:$D,4,0),\"-\")","v":"Keira"},{"$f":"IFERROR(VLOOKUP(J25,Entries!$A:$H,8,0),\"-\")","v":14},{"$f":"IFERROR(VLOOKUP(J25,Entries!$A:$F,6,0),\"-\")","v":"Unattached"},"6.01"]
[8,null,{"$f":"IFERROR(VLOOKUP(B26,Entries!$A:$E,5,0),\"-\")","v":"-"},{"$f":"IFERROR(VLOOKUP(B26,Entries!$A:$D,4,0),\"-\")","v":"-"},{"$f":"IFERROR(VLOOKUP(B26,Entries!$A:$H,8,0),\"-\")","v":"-"},{"$f":"IFERROR(VLOOKUP(B26,Entries!$A:$F,6,0),\"-\")","v":"-"},null,null,8,null,{"$f":"IFERROR(VLOOKUP(J26,Entries!$A:$E,5,0),\"-\")","v":"-"},{"$f":"IFERROR(VLOOKUP(J26,Entries!$A:$D,4,0),\"-\")","v":"-"},{"$f":"IFERROR(VLOOKUP(J26,Entries!$A:$H,8,0),\"-\")","v":"-"},{"$f":"IFERROR(VLOOKUP(J26,Entries!$A:$F,6,0),\"-\")","v":"-"}]
[9,null,{"$f":"IFERROR(VLOOKUP(B27,Entries!$A:$E,5,0),\"-\")","v":"-"},{"$f":"IFERROR(VLOOKUP(B27,Entries!$A:$D,4,0),\"-\")","v":"-"},{"$f":"IFERROR(VLOOKUP(B27,Entries!$A:$H,8,0),\"-\")","v":"-"},{"$f":"IFERROR(VLOOKUP(B27,Entries!$A:$F,6,0),\"-\")","v":"-"},null,null,9,null,{"$f":"IFERROR(VLOOKUP(J27,Entries!$A:$E,5,0),\"-\")","v":"-"},{"$f":"IFERROR(VLOOKUP(J27,Entries!$A:$D,4,0),\"-\")","v":"-"},{"$f":"IFERROR(VLOOKUP(J27,Entries!$A:$H,8,0),\"-\")","v":"-"},{"$f":"IFERROR(VLOOKUP(J27,Entries!$A:$F,6,0),\"-\")","v":"-"}]
[10,null,{"$f":"IFERROR(VLOOKUP(B28,Entries!$A:$E,5,0),\"-\")","v":"-"},{"$f":"IFERROR(VLOOKUP(B28,Entries!$A:$D,4,0),\"-\")","v":"-"},{"$f":"IFERROR(VLOOKUP(B28,Entries!$A:$H,8,0),\"-\")","v":"-"},{"$f":"IFERROR(VLOOKUP(B28,Entries!$A:$F,6,0),\"-\")","v":"-"},null,null,10,null,{"$f":"IFERROR(VLOOKUP(J28,Entries!$A:$E,5,0),\"-\")","v":"-"},{"$f":"IFERROR(VLOOKUP(J28,Entries!$A:$D,4,0),\"-\")","v":"-"},{"$f":"IFERROR(VLOOKUP(J28,Entries!$A:$H,8,0),\"-\")","v":"-"},{"$f":"IFERROR(VLOOKUP(J28,Entries!$A:$F,6,0),\"-\")","v":"-"}]
[]
[]
["U17 Men",null,null,null,null,null,null,null,"U17 Women"]
["Pos","Number","Last Name","First Name","Age","Club","Distance",null,"Pos","Number","Last Name","First Name","Age","Club","Distance"]
[1,153,{"$f":"IFERROR(VLOOKUP(B33,Entries!$A:$E,5,0),\"-\")","v":"Jerman"},{"$f":"IFERROR(VLOOKUP(B33,Entries!$A:$D,4,0),\"-\")","v":"Oscar"},{"$f":"IFERROR(VLOOKUP(B33,Entries!$A:$H,8,0),\"-\")","v":15},{"$f":"IFERROR(VLOOKUP(B33,Entries!$A:$F,6,0),\"-\")","v":"City Of Norwich AC"},"10.73",null,1,147,{"$f":"IFERROR(VLOOKUP(J33,Entries!$A:$E,5,0),\"-\")","v":"Hewitt"},{"$f":"IFERROR(VLOOKUP(J33,Entries!$A:$D,4,0),\"-\")","v":"Matilda"},{"$f":"IFERROR(VLOOKUP(J33,Entries!$A:$H,8,0),\"-\")","v":15},{"$f":"IFERROR(VLOOKUP(J33,Entries!$A:$F,6,0),\"-\")","v":"Chelmsford AC"},"13.51"]
[2,null,{"$f":"IFERROR(VLOOKUP(B34,Entries!$A:$E,5,0),\"-\")","v":"-"},{"$f":"IFERROR(VLOOKUP(B34,Entries!$A:$D,4,0),\"-\")","v":"-"},{"$f":"IFERROR(VLOOKUP(B34,Entries!$A:$H,8,0),\"-\")","v":"-"},{"$f":"IFERROR(VLOOKUP(B34,Entries!$A:$F,6,0),\"-\")","v":"-"},null,null,2,233,{"$f":"IFERROR(VLOOKUP(J34,Entries!$A:$E,5,0),\"-\")","v":"Oladele"},{"$f":"IFERROR(VLOOKUP(J34,Entries!$A:$D,4,0),\"-\")","v":"Dasia"},{"$f":"IFERROR(VLOOKUP(J34,Entries!$A:$H,8,0),\"-\")","v":15},{"$f":"IFERROR(VLOOKUP(J34,Entries!$A:$F,6,0),\"-\")","v":"Thurrock Harriers"},"10.00"]
[3,null,{"$f":"IFERROR(VLOOKUP(B35,Entries!$A:$E,5,0),\"-\")","v":"-"},{"$f":"IFERROR(VLOOKUP(B35,Entries!$A:$D,4,0),\"-\")","v":"-"},{"$f":"IFERROR(VLOOKUP(B35,Entries!$A:$H,8,0),\"-\")","v":"-"},{"$f":"IFERROR(VLOOKUP(B35,Entries!$A:$F,6,0),\"-\")","v":"-"},null,null,3,337,{"$f":"IFERROR(VLOOKUP(J35,Entries!$A:$E,5,0),\"-\")","v":"Heath"},{"$f":"IFERROR(VLOOKUP(J35,Entries!$A:$D,4,0),\"-\")","v":"Jessica"},{"$f":"IFERROR(VLOOKUP(J35,Entries!$A:$H,8,0),\"-\")","v":16},{"$f":"IFERROR(VLOOKUP(J35,Entries!$A:$F,6,0),\"-\")","v":"Basildon AC"},"8.74"]
[4,null,{"$f":"IFERROR(VLOOKUP(B36,Entries!$A:$E,5,0),\"-\")","v":"-"},{"$f":"IFERROR(VLOOKUP(B36,Entries!$A:$D,4,0),\"-\")","v":"-"},{"$f":"IFERROR(VLOOKUP(B36,Entries!$A:$H,8,0),\"-\")","v":"-"},{"$f":"IFERROR(VLOOKUP(B36,Entries!$A:$F,6,0),\"-\")","v":"-"},null,null,4,null,{"$f":"IFERROR(VLOOKUP(J36,Entries!$A:$E,5,0),\"-\")","v":"-"},{"$f":"IFERROR(VLOOKUP(J36,Entries!$A:$D,4,0),\"-\")","v":"-"},{"$f":"IFERROR(VLOOKUP(J36,Entries!$A:$H,8,0),\"-\")","v":"-"},{"$f":"IFERROR(VLOOKUP(J36,Entries!$A:$F,6,0),\"-\")","v":"-"}]
[5,null,{"$f":"IFERROR(VLOOKUP(B37,Entries!$A:$E,5,0),\"-\")","v":"-"},{"$f":"IFERROR(VLOOKUP(B37,Entries!$A:$D,4,0),\"-\")","v":"-"},{"$f":"IFERROR(VLOOKUP(B37,Entries!$A:$H,8,0),\"-\")","v":"-"},{"$f":"IFERROR(VLOOKUP(B37,Entries!$A:$F,6,0),\"-\")","v":"-"},null,null,5,null,{"$f":"IFERROR(VLOOKUP(J37,Entries!$A:$E,5,0),\"-\")","v":"-"},{"$f":"IFERROR(VLOOKUP(J37,Entries!$A:$D,4,0),\"-\")","v":"-"},{"$f":"IFERROR(VLOOKUP(J37,Entries!$A:$H,8,0),\"-\")","v":"-"},{"$f":"IFERROR(VLOOKUP(J37,Entries!$A:$F,6,0),\"-\")","v":"-"}]
[6,null,{"$f":"IFERROR(VLOOKUP(B38,Entries!$A:$E,5,0),\"-\")","v":"-"},{"$f":"IFERROR(VLOOKUP(B38,Entries!$A:$D,4,0),\"-\")","v":"-"},{"$f":"IFERROR(VLOOKUP(B38,Entries!$A:$H,8,0),\"-\")","v":"-"},{"$f":"IFERROR(VLOOKUP(B38,Entries!$A:$F,6,0),\"-\")","v":"-"},null,null,6,null,{"$f":"IFERROR(VLOOKUP(J38,Entries!$A:$E,5,0),\"-\")","v":"-"},{"$f":"IFERROR(VLOOKUP(J38,Entries!$A:$D,4,0),\"-\")","v":"-"},{"$f":"IFERROR(VLOOKUP(J38,Entries!$A:$H,8,0),\"-\")","v":"-"},{"$f":"IFERROR(VLOOKUP(J38,Entries!$A:$F,6,0),\"-\")","v":"-"}]
[7,null,{"$f":"IFERROR(VLOOKUP(B39,Entries!$A:$E,5,0),\"-\")","v":"-"},{"$f":"IFERROR(VLOOKUP(B39,Entries!$A:$D,4,0),\"-\")","v":"-"},{"$f":"IFERROR(VLOOKUP(B39,Entries!$A:$H,8,0),\"-\")","v":"-"},{"$f":"IFERROR(VLOOKUP(B39,Entries!$A:$F,6,0),\"-\")","v":"-"},null,null,7,null,{"$f":"IFERROR(VLOOKUP(J39,Entries!$A:$E,5,0),\"-\")","v":"-"},{"$f":"IFERROR(VLOOKUP(J39,Entries!$A:$D,4,0),\"-\")","v":"-"},{"$f":"IFERROR(VLOOKUP(J39,Entries!$A:$H,8,0),\"-\")","v":"-"},{"$f":"IFERROR(VLOOKUP(J39,Entries!$A:$F,6,0),\"-\")","v":"-"}]
[8,null,{"$f":"IFERROR(VLOOKUP(B40,Entries!$A:$E,5,0),\"-\")","v":"-"},{"$f":"IFERROR(VLOOKUP(B40,Entries!$A:$D,4,0),\"-\")","v":"-"},{"$f":"IFERROR(VLOOKUP(B40,Entries!$A:$H,8,0),\"-\")","v":"-"},{"$f":"IFERROR(VLOOKUP(B40,Entries!$A:$F,6,0),\"-\")","v":"-"},null,null,8,null,{"$f":"IFERROR(VLOOKUP(J40,Entries!$A:$E,5,0),\"-\")","v":"-"},{"$f":"IFERROR(VLOOKUP(J40,Entries!$A:$D,4,0),\"-\")","v":"-"},{"$f":"IFERROR(VLOOKUP(J40,Entries!$A:$H,8,0),\"-\")","v":"-"},{"$f":"IFERROR(VLOOKUP(J40,Entries!$A:$F,6,0),\"-\")","v":"-"}]
[9,null,{"$f":"IFERROR(VLOOKUP(B41,Entries!$A:$E,5,0),\"-\")","v":"-"},{"$f":"IFERROR(VLOOKUP(B41,Entries!$A:$D,4,0),\"-\")","v":"-"},{"$f":"IFERROR(VLOOKUP(B41,Entries!$A:$H,8,0),\"-\")","v":"-"},{"$f":"IFERROR(VLOOKUP(B41,Entries!$A:$F,6,0),\"-\")","v":"-"},null,null,9,null,{"$f":"IFERROR(VLOOKUP(J41,Entries!$A:$E,5,0),\"-\")","v":"-"},{"$f":"IFERROR(VLOOKUP(J41,Entries!$A:$D,4,0),\"-\")","v":"-"},{"$f":"IFERROR(VLOOKUP(J41,Entries!$A:$H,8,0),\"-\")","v":"-"},{"$f":"IFERROR(VLOOKUP(J41,Entries!$A:$F,6,0),\"-\")","v":"-"}]
[10,null,{"$f":"IFERROR(VLOOKUP(B42,Entries!$A:$E,5,0),\"-\")","v":"-"},{"$f":"IFERROR(VLOOKUP(B42,Entries!$A:$D,4,0),\"-\")","v":"-"},{"$f":"IFERROR(VLOOKUP(B42,Entries!$A:$H,8,0),\"-\")","v":"-"},{"$f":"IFERROR(VLOOKUP(B42,Entries!$A:$F,6,0),\"-\")","v":"-"},null,null,10,null,{"$f":"IFERROR(VLOOKUP(J42,Entries!$A:$E,5,0),\"-\")","v":"-"},{"$f":"IFERROR(VLOOKUP(J42,Entries!$A:$D,4,0),\"-\")","v":"-"},{"$f":"IFERROR(VLOOKUP(J42,Entries!$A:$H,8,0),\"-\")","v":"-"},{"$f":"IFERROR(VLOOKUP(J42,Entries!$A:$F,6,0),\"-\")","v":"-"}]
[]
[]
["U20 Men",null,null,null,null,null,null,null,"U20 Women"]
["Pos","Number","Last Name","First Name","Age","Club","Distance",null,"Pos","Number","Last Name","First Name","Age","Club","Distance"]
[1,201,{"$f":"IFERROR(VLOOKUP(B47,Entries!$A:$E,5,0),\"-\")","v":"Dunn"},{"$f":"IFERROR(VLOOKUP(B47,Entries!$A:$D,4,0),\"-\")","v":"Kobie"},{"$f":"IFERROR(VLOOKUP(B47,Entries!$A:$H,8,0),\"-\")","v":19},{"$f":"IFERROR(VLOOKUP(B47,Entries!$A:$F,6,0),\"-\")","v":"SS Athletics"},"8.66",null,1,76,{"$f":"IFERROR(VLOOKUP(J47,Entries!$A:$E,5,0),\"-\")","v":"Oladele "},{"$f":"IFERROR(VLOOKUP(J47,Entries!$A:$D,4,0),\"-\")","v":"Daniella"},{"$f":"IFERROR(VLOOKUP(J47,Entries!$A:$H,8,0),\"-\")","v":18},{"$f":"IFERROR(VLOOKUP(J47,Entries!$A:$F,6,0),\"-\")","v":"Thurrock Harriers"},"10.44"]
[2,null,{"$f":"IFERROR(VLOOKUP(B48,Entries!$A:$E,5,0),\"-\")","v":"-"},{"$f":"IFERROR(VLOOKUP(B48,Entries!$A:$D,4,0),\"-\")","v":"-"},{"$f":"IFERROR(VLOOKUP(B48,Entries!$A:$H,8,0),\"-\")","v":"-"},{"$f":"IFERROR(VLOOKUP(B48,Entries!$A:$F,6,0),\"-\")","v":"-"},null,null,2,null,{"$f":"IFERROR(VLOOKUP(J48,Entries!$A:$E,5,0),\"-\")","v":"-"},{"$f":"IFERROR(VLOOKUP(J48,Entries!$A:$D,4,0),\"-\")","v":"-"},{"$f":"IFERROR(VLOOKUP(J48,Entries!$A:$H,8,0),\"-\")","v":"-"},{"$f":"IFERROR(VLOOKUP(J48,Entries!$A:$F,6,0),\"-\")","v":"-"}]
[3,null,{"$f":"IFERROR(VLOOKUP(B49,Entries!$A:$E,5,0),\"-\")","v":"-"},{"$f":"IFERROR(VLOOKUP(B49,Entries!$A:$D,4,0),\"-\")","v":"-"},{"$f":"IFERROR(VLOOKUP(B49,Entries!$A:$H,8,0),\"-\")","v":"-"},{"$f":"IFERROR(VLOOKUP(B49,Entries!$A:$F,6,0),\"-\")","v":"-"},null,null,3,null,{"$f":"IFERROR(VLOOKUP(J49,Entries!$A:$E,5,0),\"-\")","v":"-"},{"$f":"IFERROR(VLOOKUP(J49,Entries!$A:$D,4,0),\"-\")","v":"-"},{"$f":"IFERROR(VLOOKUP(J49,Entries!$A:$H,8,0),\"-\")","v":"-"},{"$f":"IFERROR(VLOOKUP(J49,Entries!$A:$F,6,0),\"-\")","v":"-"}]
[4,null,{"$f":"IFERROR(VLOOKUP(B50,Entries!$A:$E,5,0),\"-\")","v":"-"},{"$f":"IFERROR(VLOOKUP(B50,Entries!$A:$D,4,0),\"-\")","v":"-"},{"$f":"IFERROR(VLOOKUP(B50,Entries!$A:$H,8,0),\"-\")","v":"-"},{"$f":"IFERROR(VLOOKUP(B50,Entries!$A:$F,6,0),\"-\")","v":"-"},null,null,4,null,{"$f":"IFERROR(VLOOKUP(J50,Entries!$A:$E,5,0),\"-\")","v":"-"},{"$f":"IFERROR(VLOOKUP(J50,Entries!$A:$D,4,0),\"-\")","v":"-"},{"$f":"IFERROR(VLOOKUP(J50,Entries!$A:$H,8,0),\"-\")","v":"-"},{"$f":"IFERROR(VLOOKUP(J50,Entries!$A:$F,6,0),\"-\")","v":"-"}]
[5,null,{"$f":"IFERROR(VLOOKUP(B51,Entries!$A:$E,5,0),\"-\")","v":"-"},{"$f":"IFERROR(VLOOKUP(B51,Entries!$A:$D,4,0),\"-\")","v":"-"},{"$f":"IFERROR(VLOOKUP(B51,Entries!$A:$H,8,0),\"-\")","v":"-"},{"$f":"IFERROR(VLOOKUP(B51,Entries!$A:$F,6,0),\"-\")","v":"-"},null,null,5,null,{"$f":"IFERROR(VLOOKUP(J51,Entries!$A:$E,5,0),\"-\")","v":"-"},{"$f":"IFERROR(VLOOKUP(J51,Entries!$A:$D,4,0),\"-\")","v":"-"},{"$f":"IFERROR(VLOOKUP(J51,Entries!$A:$H,8,0),\"-\")","v":"-"},{"$f":"IFERROR(VLOOKUP(J51,Entries!$A:$F,6,0),\"-\")","v":"-"}]
[6,null,{"$f":"IFERROR(VLOOKUP(B52,Entries!$A:$E,5,0),\"-\")","v":"-"},{"$f":"IFERROR(VLOOKUP(B52,Entries!$A:$D,4,0),\"-\")","v":"-"},{"$f":"IFERROR(VLOOKUP(B52,Entries!$A:$H,8,0),\"-\")","v":"-"},{"$f":"IFERROR(VLOOKUP(B52,Entries!$A:$F,6,0),\"-\")","v":"-"},null,null,6,null,{"$f":"IFERROR(VLOOKUP(J52,Entries!$A:$E,5,0),\"-\")","v":"-"},{"$f":"IFERROR(VLOOKUP(J52,Entries!$A:$D,4,0),\"-\")","v":"-"},{"$f":"IFERROR(VLOOKUP(J52,Entries!$A:$H,8,0),\"-\")","v":"-"},{"$f":"IFERROR(VLOOKUP(J52,Entries!$A:$F,6,0),\"-\")","v":"-"}]
[7,null,{"$f":"IFERROR(VLOOKUP(B53,Entries!$A:$E,5,0),\"-\")","v":"-"},{"$f":"IFERROR(VLOOKUP(B53,Entries!$A:$D,4,0),\"-\")","v":"-"},{"$f":"IFERROR(VLOOKUP(B53,Entries!$A:$H,8,0),\"-\")","v":"-"},{"$f":"IFERROR(VLOOKUP(B53,Entries!$A:$F,6,0),\"-\")","v":"-"},null,null,7,null,{"$f":"IFERROR(VLOOKUP(J53,Entries!$A:$E,5,0),\"-\")","v":"-"},{"$f":"IFERROR(VLOOKUP(J53,Entries!$A:$D,4,0),\"-\")","v":"-"},{"$f":"IFERROR(VLOOKUP(J53,Entries!$A:$H,8,0),\"-\")","v":"-"},{"$f":"IFERROR(VLOOKUP(J53,Entries!$A:$F,6,0),\"-\")","v":"-"}]
[8,null,{"$f":"IFERROR(VLOOKUP(B54,Entries!$A:$E,5,0),\"-\")","v":"-"},{"$f":"IFERROR(VLOOKUP(B54,Entries!$A:$D,4,0),\"-\")","v":"-"},{"$f":"IFERROR(VLOOKUP(B54,Entries!$A:$H,8,0),\"-\")","v":"-"},{"$f":"IFERROR(VLOOKUP(B54,Entries!$A:$F,6,0),\"-\")","v":"-"},null,null,8,null,{"$f":"IFERROR(VLOOKUP(J54,Entries!$A:$E,5,0),\"-\")","v":"-"},{"$f":"IFERROR(VLOOKUP(J54,Entries!$A:$D,4,0),\"-\")","v":"-"},{"$f":"IFERROR(VLOOKUP(J54,Entries!$A:$H,8,0),\"-\")","v":"-"},{"$f":"IFERROR(VLOOKUP(J54,Entries!$A:$F,6,0),\"-\")","v":"-"}]
[9,null,{"$f":"IFERROR(VLOOKUP(B55,Entries!$A:$E,5,0),\"-\")","v":"-"},{"$f":"IFERROR(VLOOKUP(B55,Entries!$A:$D,4,0),\"-\")","v":"-"},{"$f":"IFERROR(VLOOKUP(B55,Entries!$A:$H,8,0),\"-\")","v":"-"},{"$f":"IFERROR(VLOOKUP(B55,Entries!$A:$F,6,0),\"-\")","v":"-"},null,null,9,null,{"$f":"IFERROR(VLOOKUP(J55,Entries!$A:$E,5,0),\"-\")","v":"-"},{"$f":"IFERROR(VLOOKUP(J55,Entries!$A:$D,4,0),\"-\")","v":"-"},{"$f":"IFERROR(VLOOKUP(J55,Entries!$A:$H,8,0),\"-\")","v":"-"},{"$f":"IFERROR(VLOOKUP(J55,Entries!$A:$F,6,0),\"-\")","v":"-"}]
[10,null,{"$f":"IFERROR(VLOOKUP(B56,Entries!$A:$E,5,0),\"-\")","v":"-"},{"$f":"IFERROR(VLOOKUP(B56,Entries!$A:$D,4,0),\"-\")","v":"-"},{"$f":"IFERROR(VLOOKUP(B56,Entries!$A:$H,8,0),\"-\")","v":"-"},{"$f":"IFERROR(VLOOKUP(B56,Entries!$A:$F,6,0),\"-\")","v":"-"},null,null,10,null,{"$f":"IFERROR(VLOOKUP(J56,Entries!$A:$E,5,0),\"-\")","v":"-"},{"$f":"IFERROR(VLOOKUP(J56,Entries!$A:$D,4,0),\"-\")","v":"-"},{"$f":"IFERROR(VLOOKUP(J56,Entries!$A:$H,8,0),\"-\")","v":"-"},{"$f":"IFERROR(VLOOKUP(J56,Entries!$A:$F,6,0),\"-\")","v":"-"}]
[]
[]
["Senior Men"]
["Pos","Number","Last Name","First Name","Age","Club","Distance"]
[1,287,{"$f":"IFERROR(VLOOKUP(B61,Entries!$A:$E,5,0),\"-\")","v":"Praim-Singh"},{"$f":"IFERROR(VLOOKUP(B61,Entries!$A:$D,4,0),\"-\")","v":"Billy"},{"$f":"IFERROR(VLOOKUP(B61,Entries!$A:$H,8,0),\"-\")","v":25},{"$f":"IFERROR(VLOOKUP(B61,Entries!$A:$F,6,0),\"-\")","v":"City of Southend On Sea AC"},"12.98"]
[2,85,{"$f":"IFERROR(VLOOKUP(B62,Entries!$A:$E,5,0),\"-\")","v":"Linton"},{"$f":"IFERROR(VLOOKUP(B62,Entries!$A:$D,4,0),\"-\")","v":"Khuwayne"},{"$f":"IFERROR(VLOOKUP(B62,Entries!$A:$H,8,0),\"-\")","v":23},{"$f":"IFERROR(VLOOKUP(B62,Entries!$A:$F,6,0),\"-\")","v":"Harrow AC"},"12.24"]
[3,282,{"$f":"IFERROR(VLOOKUP(B63,Entries!$A:$E,5,0),\"-\")","v":"York"},{"$f":"IFERROR(VLOOKUP(B63,Entries!$A:$D,4,0),\"-\")","v":"Aaron"},{"$f":"IFERROR(VLOOKUP(B63,Entries!$A:$H,8,0),\"-\")","v":28},{"$f":"IFERROR(VLOOKUP(B63,Entries!$A:$F,6,0),\"-\")","v":"Basildon AC"},"10.31"]
[4,279,{"$f":"IFERROR(VLOOKUP(B64,Entries!$A:$E,5,0),\"-\")","v":"Young"},{"$f":"IFERROR(VLOOKUP(B64,Entries!$A:$D,4,0),\"-\")","v":"Jake"},{"$f":"IFERROR(VLOOKUP(B64,Entries!$A:$H,8,0),\"-\")","v":34},{"$f":"IFERROR(VLOOKUP(B64,Entries!$A:$F,6,0),\"-\")","v":"SS Athletics"},"9.30"]
[5,null,{"$f":"IFERROR(VLOOKUP(B65,Entries!$A:$E,5,0),\"-\")","v":"-"},{"$f":"IFERROR(VLOOKUP(B65,Entries!$A:$D,4,0),\"-\")","v":"-"},{"$f":"IFERROR(VLOOKUP(B65,Entries!$A:$H,8,0),\"-\")","v":"-"},{"$f":"IFERROR(VLOOKUP(B65,Entries!$A:$F,6,0),\"-\")","v":"-"}]
[6,null,{"$f":"IFERROR(VLOOKUP(B66,Entries!$A:$E,5,0),\"-\")","v":"-"},{"$f":"IFERROR(VLOOKUP(B66,Entries!$A:$D,4,0),\"-\")","v":"-"},{"$f":"IFERROR(VLOOKUP(B66,Entries!$A:$H,8,0),\"-\")","v":"-"},{"$f":"IFERROR(VLOOKUP(B66,Entries!$A:$F,6,0),\"-\")","v":"-"}]
[7,null,{"$f":"IFERROR(VLOOKUP(B67,Entries!$A:$E,5,0),\"-\")","v":"-"},{"$f":"IFERROR(VLOOKUP(B67,Entries!$A:$D,4,0),\"-\")","v":"-"},{"$f":"IFERROR(VLOOKUP(B67,Entries!$A:$H,8,0),\"-\")","v":"-"},{"$f":"IFERROR(VLOOKUP(B67,Entries!$A:$F,6,0),\"-\")","v":"-"}]
[8,null,{"$f":"IFERROR(VLOOKUP(B68,Entries!$A:$E,5,0),\"-\")","v":"-"},{"$f":"IFERROR(VLOOKUP(B68,Entries!$A:$D,4,0),\"-\")","v":"-"},{"$f":"IFERROR(VLOOKUP(B68,Entries!$A:$H,8,0),\"-\")","v":"-"},{"$f":"IFERROR(VLOOKUP(B68,Entries!$A:$F,6,0),\"-\")","v":"-"}]
[9,null,{"$f":"IFERROR(VLOOKUP(B69,Entries!$A:$E,5,0),\"-\")","v":"-"},{"$f":"IFERROR(VLOOKUP(B69,Entries!$A:$D,4,0),\"-\")","v":"-"},{"$f":"IFERROR(VLOOKUP(B69,Entries!$A:$H,8,0),\"-\")","v":"-"},{"$f":"IFERROR(VLOOKUP(B69,Entries!$A:$F,6,0),\"-\")","v":"-"}]
[10,null,{"$f":"IFERROR(VLOOKUP(B70,Entries!$A:$E,5,0),\"-\")","v":"-"},{"$f":"IFERROR(VLOOKUP(B70,Entries!$A:$D,4,0),\"-\")","v":"-"},{"$f":"IFERROR(VLOOKUP(B70,Entries!$A:$H,8,0),\"-\")","v":"-"},{"$f":"IFERROR(VLOOKUP(B70,Entries!$A:$F,6,0),\"-\")","v":"-"}]
[]
[]
[null,null,null,null,null,null,null,null,"Veteran Women"]
[null,null,null,null,null,null,null,null,"Pos","Number","Last Name","First Name","Age","Club","Distance"]
[null,null,null,null,null,null,null,null,1,60,{"$f":"IFERROR(VLOOKUP(J75,Entries!$A:$E,5,0),\"-\")","v":"Richardson"},{"$f":"IFERROR(VLOOKUP(J75,Entries!$A:$D,4,0),\"-\")","v":"Lesley"},{"$f":"IFERROR(VLOOKUP(J75,Entries!$A:$H,8,0),\"-\")","v":55},{"$f":"IFERROR(VLOOKUP(J75,Entries!$A:$F,6,0),\"-\")","v":"Enfield and Haringey A C"},"8.25"]
[null,null,null,null,null,null,null,null,2,139,{"$f":"IFERROR(VLOOKUP(J76,Entries!$A:$E,5,0),\"-\")","v":"Norton"},{"$f":"IFERROR(VLOOKUP(J76,Entries!$A:$D,4,0),\"-\")","v":"Sarah"},{"$f":"IFERROR(VLOOKUP(J76,Entries!$A:$H,8,0),\"-\")","v":52},{"$f":"IFERROR(VLOOKUP(J76,Entries!$A:$F,6,0),\"-\")","v":"Castle Point Joggers"},"5.86"]
[null,null,null,null,null,null,null,null,null,null,{"$f":"IFERROR(VLOOKUP(J77,Entries!$A:$E,5,0),\"-\")","v":"-"},{"$f":"IFERROR(VLOOKUP(J77,Entries!$A:$D,4,0),\"-\")","v":"-"},{"$f":"IFERROR(VLOOKUP(J77,Entries!$A:$H,8,0),\"-\")","v":"-"},{"$f":"IFERROR(VLOOKUP(J77,Entries!$A:$F,6,0),\"-\")","v":"-"}]
[null,null,null,null,null,null,null,null,1,345,{"$f":"IFERROR(VLOOKUP(J78,Entries!$A:$E,5,0),\"-\")","v":"Donnelly"},{"$f":"IFERROR(VLOOKUP(J78,Entries!$A:$D,4,0),\"-\")","v":"Linda"},{"$f":"IFERROR(VLOOKUP(J78,Entries!$A:$H,8,0),\"-\")","v":66},{"$f":"IFERROR(VLOOKUP(J78,Entries!$A:$F,6,0),\"-\")","v":"City of Southend On Sea AC"},"5.18"]
[null,null,null,null,null,null,null,null,null,null,{"$f":"IFERROR(VLOOKUP(J79,Entries!$A:$E,5,0),\"-\")","v":"-"},{"$f":"IFERROR(VLOOKUP(J79,Entries!$A:$D,4,0),\"-\")","v":"-"},{"$f":"IFERROR(VLOOKUP(J79,Entries!$A:$H,8,0),\"-\")","v":"-"},{"$f":"IFERROR(VLOOKUP(J79,Entries!$A:$F,6,0),\"-\")","v":"-"}]
[null,null,null,null,null,null,null,null,1,13,{"$f":"IFERROR(VLOOKUP(J80,Entries!$A:$E,5,0),\"-\")","v":"Stamp"},{"$f":"IFERROR(VLOOKUP(J80,Entries!$A:$D,4,0),\"-\")","v":"Stephanie"},{"$f":"IFERROR(VLOOKUP(J80,Entries!$A:$H,8,0),\"-\")","v":72},{"$f":"IFERROR(VLOOKUP(J80,Entries!$A:$F,6,0),\"-\")","v":"City of Southend On Sea AC"},"5.26"]
[null,null,null,null,null,null,null,null,null,null,{"$f":"IFERROR(VLOOKUP(J81,Entries!$A:$E,5,0),\"-\")","v":"-"},{"$f":"IFERROR(VLOOKUP(J81,Entries!$A:$D,4,0),\"-\")","v":"-"},{"$f":"IFERROR(VLOOKUP(J81,Entries!$A:$H,8,0),\"-\")","v":"-"},{"$f":"IFERROR(VLOOKUP(J81,Entries!$A:$F,6,0),\"-\")","v":"-"}]
[null,null,null,null,null,null,null,null,null,null,{"$f":"IFERROR(VLOOKUP(J82,Entries!$A:$E,5,0),\"-\")","v":"-"},{"$f":"IFERROR(VLOOKUP(J82,Entries!$A:$D,4,0),\"-\")","v":"-"},{"$f":"IFERROR(VLOOKUP(J82,Entries!$A:$H,8,0),\"-\")","v":"-"},{"$f":"IFERROR(VLOOKUP(J82,Entries!$A:$F,6,0),\"-\")","v":"-"}]
[null,null,null,null,null,null,null,null,null,null,{"$f":"IFERROR(VLOOKUP(J83,Entries!$A:$E,5,0),\"-\")","v":"-"},{"$f":"IFERROR(VLOOKUP(J83,Entries!$A:$D,4,0),\"-\")","v":"-"},{"$f":"IFERROR(VLOOKUP(J83,Entries!$A:$H,8,0),\"-\")","v":"-"},{"$f":"IFERROR(VLOOKUP(J83,Entries!$A:$F,6,0),\"-\")","v":"-"}]
[null,null,null,null,null,null,null,null,null,null,{"$f":"IFERROR(VLOOKUP(J84,Entries!$A:$E,5,0),\"-\")","v":"-"},{"$f":"IFERROR(VLOOKUP(J84,Entries!$A:$D,4,0),\"-\")","v":"-"},{"$f":"IFERROR(VLOOKUP(J84,Entries!$A:$H,8,0),\"-\")","v":"-"},{"$f":"IFERROR(VLOOKUP(J84,Entries!$A:$F,6,0),\"-\")","v":"-"}]

{"sheet":"Discus","index":17,"n_rows":84,"n_cols":15,"rows_kept":84,"cut":false,"hidden":false,"merged":[]}
["Discus"]
[]
["U13 Boys",null,null,null,null,null,null,null,"U13 Girls"]
["Pos","Number","Last Name","First Name","Age","Club","Distance",null,"Pos","Number","Last Name","First Name","Age","Club","Distance"]
[1,119,{"$f":"IFERROR(VLOOKUP(B5,Entries!$A:$E,5,0),\"-\")","v":"Petherbridge"},{"$f":"IFERROR(VLOOKUP(B5,Entries!$A:$D,4,0),\"-\")","v":"Zac"},{"$f":"IFERROR(VLOOKUP(B5,Entries!$A:$H,8,0),\"-\")","v":12},{"$f":"IFERROR(VLOOKUP(B5,Entries!$A:$F,6,0),\"-\")","v":"SS Athletics"},"28.33",null,1,216,{"$f":"IFERROR(VLOOKUP(J5,Entries!$A:$E,5,0),\"-\")","v":"Arnold"},{"$f":"IFERROR(VLOOKUP(J5,Entries!$A:$D,4,0),\"-\")","v":"Jessica"},{"$f":"IFERROR(VLOOKUP(J5,Entries!$A:$H,8,0),\"-\")","v":12},{"$f":"IFERROR(VLOOKUP(J5,Entries!$A:$F,6,0),\"-\")","v":"Brentwood Beagles Athletics Club"},"21.32"]
[2,8,{"$f":"IFERROR(VLOOKUP(B6,Entries!$A:$E,5,0),\"-\")","v":"Armour"},{"$f":"IFERROR(VLOOKUP(B6,Entries!$A:$D,4,0),\"-\")","v":"Adam"},{"$f":"IFERROR(VLOOKUP(B6,Entries!$A:$H,8,0),\"-\")","v":12},{"$f":"IFERROR(VLOOKUP(B6,Entries!$A:$F,6,0),\"-\")","v":"Brentwood Beagles Athletics Club"},"18.09",null,2,181,{"$f":"IFERROR(VLOOKUP(J6,Entries!$A:$E,5,0),\"-\")","v":"Williams"},{"$f":"IFERROR(VLOOKUP(J6,Entries!$A:$D,4,0),\"-\")","v":"Zenobia"},{"$f":"IFERROR(VLOOKUP(J6,Entries!$A:$H,8,0),\"-\")","v":12},{"$f":"IFERROR(VLOOKUP(J6,Entries!$A:$F,6,0),\"-\")","v":"Havering AC"},"20.48"]
[3,126,{"$f":"IFERROR(VLOOKUP(B7,Entries!$A:$E,5,0),\"-\")","v":"Fahmy"},{"$f":"IFERROR(VLOOKUP(B7,Entries!$A:$D,4,0),\"-\")","v":"Seif"},{"$f":"IFERROR(VLOOKUP(B7,Entries!$A:$H,8,0),\"-\")","v":11},{"$f":"IFERROR(VLOOKUP(B7,Entries!$A:$F,6,0),\"-\")","v":"SS Athletics"},"16.02",null,3,154,{"$f":"IFERROR(VLOOKUP(J7,Entries!$A:$E,5,0),\"-\")","v":"Osei"},{"$f":"IFERROR(VLOOKUP(J7,Entries!$A:$D,4,0),\"-\")","v":"Oluwatimileyin Elizabeth"},{"$f":"IFERROR(VLOOKUP(J7,Entries!$A:$H,8,0),\"-\")","v":12},{"$f":"IFERROR(VLOOKUP(J7,Entries!$A:$F,6,0),\"-\")","v":"Chelmsford AC"},"16.78"]
[4,null,{"$f":"IFERROR(VLOOKUP(B8,Entries!$A:$E,5,0),\"-\")","v":"-"},{"$f":"IFERROR(VLOOKUP(B8,Entries!$A:$D,4,0),\"-\")","v":"-"},{"$f":"IFERROR(VLOOKUP(B8,Entries!$A:$H,8,0),\"-\")","v":"-"},{"$f":"IFERROR(VLOOKUP(B8,Entries!$A:$F,6,0),\"-\")","v":"-"},null,null,4,192,{"$f":"IFERROR(VLOOKUP(J8,Entries!$A:$E,5,0),\"-\")","v":"Moss"},{"$f":"IFERROR(VLOOKUP(J8,Entries!$A:$D,4,0),\"-\")","v":"Maddie"},{"$f":"IFERROR(VLOOKUP(J8,Entries!$A:$H,8,0),\"-\")","v":12},{"$f":"IFERROR(VLOOKUP(J8,Entries!$A:$F,6,0),\"-\")","v":"Chelmsford AC"},"16.28"]
[5,null,{"$f":"IFERROR(VLOOKUP(B9,Entries!$A:$E,5,0),\"-\")","v":"-"},{"$f":"IFERROR(VLOOKUP(B9,Entries!$A:$D,4,0),\"-\")","v":"-"},{"$f":"IFERROR(VLOOKUP(B9,Entries!$A:$H,8,0),\"-\")","v":"-"},{"$f":"IFERROR(VLOOKUP(B9,Entries!$A:$F,6,0),\"-\")","v":"-"},null,null,5,51,{"$f":"IFERROR(VLOOKUP(J9,Entries!$A:$E,5,0),\"-\")","v":"Owen"},{"$f":"IFERROR(VLOOKUP(J9,Entries!$A:$D,4,0),\"-\")","v":"Sadie"},{"$f":"IFERROR(VLOOKUP(J9,Entries!$A:$H,8,0),\"-\")","v":12},{"$f":"IFERROR(VLOOKUP(J9,Entries!$A:$F,6,0),\"-\")","v":"SS Athletics"},"14.72"]
[6,null,{"$f":"IFERROR(VLOOKUP(B10,Entries!$A:$E,5,0),\"-\")","v":"-"},{"$f":"IFERROR(VLOOKUP(B10,Entries!$A:$D,4,0),\"-\")","v":"-"},{"$f":"IFERROR(VLOOKUP(B10,Entries!$A:$H,8,0),\"-\")","v":"-"},{"$f":"IFERROR(VLOOKUP(B10,Entries!$A:$F,6,0),\"-\")","v":"-"},null,null,6,253,{"$f":"IFERROR(VLOOKUP(J10,Entries!$A:$E,5,0),\"-\")","v":"Motin"},{"$f":"IFERROR(VLOOKUP(J10,Entries!$A:$D,4,0),\"-\")","v":"Sofia"},{"$f":"IFERROR(VLOOKUP(J10,Entries!$A:$H,8,0),\"-\")","v":11},{"$f":"IFERROR(VLOOKUP(J10,Entries!$A:$F,6,0),\"-\")","v":"City of Southend On Sea AC"},"12.23"]
[7,null,{"$f":"IFERROR(VLOOKUP(B11,Entries!$A:$E,5,0),\"-\")","v":"-"},{"$f":"IFERROR(VLOOKUP(B11,Entries!$A:$D,4,0),\"-\")","v":"-"},{"$f":"IFERROR(VLOOKUP(B11,Entries!$A:$H,8,0),\"-\")","v":"-"},{"$f":"IFERROR(VLOOKUP(B11,Entries!$A:$F,6,0),\"-\")","v":"-"},null,null,7,303,{"$f":"IFERROR(VLOOKUP(J11,Entries!$A:$E,5,0),\"-\")","v":"Bucci"},{"$f":"IFERROR(VLOOKUP(J11,Entries!$A:$D,4,0),\"-\")","v":"Kai"},{"$f":"IFERROR(VLOOKUP(J11,Entries!$A:$H,8,0),\"-\")","v":12},{"$f":"IFERROR(VLOOKUP(J11,Entries!$A:$F,6,0),\"-\")","v":"SS Athletics"},"12.11"]
[8,null,{"$f":"IFERROR(VLOOKUP(B12,Entries!$A:$E,5,0),\"-\")","v":"-"},{"$f":"IFERROR(VLOOKUP(B12,Entries!$A:$D,4,0),\"-\")","v":"-"},{"$f":"IFERROR(VLOOKUP(B12,Entries!$A:$H,8,0),\"-\")","v":"-"},{"$f":"IFERROR(VLOOKUP(B12,Entries!$A:$F,6,0),\"-\")","v":"-"},null,null,8,null,{"$f":"IFERROR(VLOOKUP(J12,Entries!$A:$E,5,0),\"-\")","v":"-"},{"$f":"IFERROR(VLOOKUP(J12,Entries!$A:$D,4,0),\"-\")","v":"-"},{"$f":"IFERROR(VLOOKUP(J12,Entries!$A:$H,8,0),\"-\")","v":"-"},{"$f":"IFERROR(VLOOKUP(J12,Entries!$A:$F,6,0),\"-\")","v":"-"}]
[9,null,{"$f":"IFERROR(VLOOKUP(B13,Entries!$A:$E,5,0),\"-\")","v":"-"},{"$f":"IFERROR(VLOOKUP(B13,Entries!$A:$D,4,0),\"-\")","v":"-"},{"$f":"IFERROR(VLOOKUP(B13,Entries!$A:$H,8,0),\"-\")","v":"-"},{"$f":"IFERROR(VLOOKUP(B13,Entries!$A:$F,6,0),\"-\")","v":"-"},null,null,9,null,{"$f":"IFERROR(VLOOKUP(J13,Entries!$A:$E,5,0),\"-\")","v":"-"},{"$f":"IFERROR(VLOOKUP(J13,Entries!$A:$D,4,0),\"-\")","v":"-"},{"$f":"IFERROR(VLOOKUP(J13,Entries!$A:$H,8,0),\"-\")","v":"-"},{"$f":"IFERROR(VLOOKUP(J13,Entries!$A:$F,6,0),\"-\")","v":"-"}]
[10,null,{"$f":"IFERROR(VLOOKUP(B14,Entries!$A:$E,5,0),\"-\")","v":"-"},{"$f":"IFERROR(VLOOKUP(B14,Entries!$A:$D,4,0),\"-\")","v":"-"},{"$f":"IFERROR(VLOOKUP(B14,Entries!$A:$H,8,0),\"-\")","v":"-"},{"$f":"IFERROR(VLOOKUP(B14,Entries!$A:$F,6,0),\"-\")","v":"-"},null,null,10,null,{"$f":"IFERROR(VLOOKUP(J14,Entries!$A:$E,5,0),\"-\")","v":"-"},{"$f":"IFERROR(VLOOKUP(J14,Entries!$A:$D,4,0),\"-\")","v":"-"},{"$f":"IFERROR(VLOOKUP(J14,Entries!$A:$H,8,0),\"-\")","v":"-"},{"$f":"IFERROR(VLOOKUP(J14,Entries!$A:$F,6,0),\"-\")","v":"-"}]
[]
[]
["U15 Boys",null,null,null,null,null,null,null,"U15 Girls"]
["Pos","Number","Last Name","First Name","Age","Club","Distance",null,"Pos","Number","Last Name","First Name","Age","Club","Distance"]
[1,250,{"$f":"IFERROR(VLOOKUP(B19,Entries!$A:$E,5,0),\"-\")","v":"Weston"},{"$f":"IFERROR(VLOOKUP(B19,Entries!$A:$D,4,0),\"-\")","v":"Jack"},{"$f":"IFERROR(VLOOKUP(B19,Entries!$A:$H,8,0),\"-\")","v":14},{"$f":"IFERROR(VLOOKUP(B19,Entries!$A:$F,6,0),\"-\")","v":"Basildon AC"},"26.89",null,1,246,{"$f":"IFERROR(VLOOKUP(J19,Entries!$A:$E,5,0),\"-\")","v":"Malagala"},{"$f":"IFERROR(VLOOKUP(J19,Entries!$A:$D,4,0),\"-\")","v":"Monica"},{"$f":"IFERROR(VLOOKUP(J19,Entries!$A:$H,8,0),\"-\")","v":14},{"$f":"IFERROR(VLOOKUP(J19,Entries!$A:$F,6,0),\"-\")","v":"Chelmsford AC"},"30.48"]
[2,356,{"$f":"IFERROR(VLOOKUP(B20,Entries!$A:$E,5,0),\"-\")","v":"Bajela"},{"$f":"IFERROR(VLOOKUP(B20,Entries!$A:$D,4,0),\"-\")","v":"Isaac"},{"$f":"IFERROR(VLOOKUP(B20,Entries!$A:$H,8,0),\"-\")","v":14},{"$f":"IFERROR(VLOOKUP(B20,Entries!$A:$F,6,0),\"-\")","v":"City of Southend On Sea AC"},"14.64",null,2,116,{"$f":"IFERROR(VLOOKUP(J20,Entries!$A:$E,5,0),\"-\")","v":"Jones"},{"$f":"IFERROR(VLOOKUP(J20,Entries!$A:$D,4,0),\"-\")","v":"Izzy"},{"$f":"IFERROR(VLOOKUP(J20,Entries!$A:$H,8,0),\"-\")","v":14},{"$f":"IFERROR(VLOOKUP(J20,Entries!$A:$F,6,0),\"-\")","v":"SS Athletics"},"23.27"]
[3,null,{"$f":"IFERROR(VLOOKUP(B21,Entries!$A:$E,5,0),\"-\")","v":"-"},{"$f":"IFERROR(VLOOKUP(B21,Entries!$A:$D,4,0),\"-\")","v":"-"},{"$f":"IFERROR(VLOOKUP(B21,Entries!$A:$H,8,0),\"-\")","v":"-"},{"$f":"IFERROR(VLOOKUP(B21,Entries!$A:$F,6,0),\"-\")","v":"-"},null,null,3,202,{"$f":"IFERROR(VLOOKUP(J21,Entries!$A:$E,5,0),\"-\")","v":"Newton"},{"$f":"IFERROR(VLOOKUP(J21,Entries!$A:$D,4,0),\"-\")","v":"Alba"},{"$f":"IFERROR(VLOOKUP(J21,Entries!$A:$H,8,0),\"-\")","v":13},{"$f":"IFERROR(VLOOKUP(J21,Entries!$A:$F,6,0),\"-\")","v":"City of Southend On Sea AC"},"23.06"]
[4,null,{"$f":"IFERROR(VLOOKUP(B22,Entries!$A:$E,5,0),\"-\")","v":"-"},{"$f":"IFERROR(VLOOKUP(B22,Entries!$A:$D,4,0),\"-\")","v":"-"},{"$f":"IFERROR(VLOOKUP(B22,Entries!$A:$H,8,0),\"-\")","v":"-"},{"$f":"IFERROR(VLOOKUP(B22,Entries!$A:$F,6,0),\"-\")","v":"-"},null,null,4,94,{"$f":"IFERROR(VLOOKUP(J22,Entries!$A:$E,5,0),\"-\")","v":"Poulter"},{"$f":"IFERROR(VLOOKUP(J22,Entries!$A:$D,4,0),\"-\")","v":"Madison"},{"$f":"IFERROR(VLOOKUP(J22,Entries!$A:$H,8,0),\"-\")","v":14},{"$f":"IFERROR(VLOOKUP(J22,Entries!$A:$F,6,0),\"-\")","v":"Chelmsford AC"},"22.61"]
[5,null,{"$f":"IFERROR(VLOOKUP(B23,Entries!$A:$E,5,0),\"-\")","v":"-"},{"$f":"IFERROR(VLOOKUP(B23,Entries!$A:$D,4,0),\"-\")","v":"-"},{"$f":"IFERROR(VLOOKUP(B23,Entries!$A:$H,8,0),\"-\")","v":"-"},{"$f":"IFERROR(VLOOKUP(B23,Entries!$A:$F,6,0),\"-\")","v":"-"},null,null,5,73,{"$f":"IFERROR(VLOOKUP(J23,Entries!$A:$E,5,0),\"-\")","v":"Sladden"},{"$f":"IFERROR(VLOOKUP(J23,Entries!$A:$D,4,0),\"-\")","v":"Dakota"},{"$f":"IFERROR(VLOOKUP(J23,Entries!$A:$H,8,0),\"-\")","v":14},{"$f":"IFERROR(VLOOKUP(J23,Entries!$A:$F,6,0),\"-\")","v":"SS Athletics"},"21.49"]
[6,null,{"$f":"IFERROR(VLOOKUP(B24,Entries!$A:$E,5,0),\"-\")","v":"-"},{"$f":"IFERROR(VLOOKUP(B24,Entries!$A:$D,4,0),\"-\")","v":"-"},{"$f":"IFERROR(VLOOKUP(B24,Entries!$A:$H,8,0),\"-\")","v":"-"},{"$f":"IFERROR(VLOOKUP(B24,Entries!$A:$F,6,0),\"-\")","v":"-"},null,null,6,271,{"$f":"IFERROR(VLOOKUP(J24,Entries!$A:$E,5,0),\"-\")","v":"Barron"},{"$f":"IFERROR(VLOOKUP(J24,Entries!$A:$D,4,0),\"-\")","v":"Isla"},{"$f":"IFERROR(VLOOKUP(J24,Entries!$A:$H,8,0),\"-\")","v":13},{"$f":"IFERROR(VLOOKUP(J24,Entries!$A:$F,6,0),\"-\")","v":"Woodford Green AC with Essex Ladies"},"19.09"]
[7,null,{"$f":"IFERROR(VLOOKUP(B25,Entries!$A:$E,5,0),\"-\")","v":"-"},{"$f":"IFERROR(VLOOKUP(B25,Entries!$A:$D,4,0),\"-\")","v":"-"},{"$f":"IFERROR(VLOOKUP(B25,Entries!$A:$H,8,0),\"-\")","v":"-"},{"$f":"IFERROR(VLOOKUP(B25,Entries!$A:$F,6,0),\"-\")","v":"-"},null,null,7,198,{"$f":"IFERROR(VLOOKUP(J25,Entries!$A:$E,5,0),\"-\")","v":"Hawkins"},{"$f":"IFERROR(VLOOKUP(J25,Entries!$A:$D,4,0),\"-\")","v":"Katie"},{"$f":"IFERROR(VLOOKUP(J25,Entries!$A:$H,8,0),\"-\")","v":14},{"$f":"IFERROR(VLOOKUP(J25,Entries!$A:$F,6,0),\"-\")","v":"Brentwood Beagles Athletics Club"},"18.53"]
[8,null,{"$f":"IFERROR(VLOOKUP(B26,Entries!$A:$E,5,0),\"-\")","v":"-"},{"$f":"IFERROR(VLOOKUP(B26,Entries!$A:$D,4,0),\"-\")","v":"-"},{"$f":"IFERROR(VLOOKUP(B26,Entries!$A:$H,8,0),\"-\")","v":"-"},{"$f":"IFERROR(VLOOKUP(B26,Entries!$A:$F,6,0),\"-\")","v":"-"},null,null,8,18,{"$f":"IFERROR(VLOOKUP(J26,Entries!$A:$E,5,0),\"-\")","v":"Makepeace"},{"$f":"IFERROR(VLOOKUP(J26,Entries!$A:$D,4,0),\"-\")","v":"Stevie"},{"$f":"IFERROR(VLOOKUP(J26,Entries!$A:$H,8,0),\"-\")","v":13},{"$f":"IFERROR(VLOOKUP(J26,Entries!$A:$F,6,0),\"-\")","v":"City of Southend On Sea AC"},"17.94"]
[9,null,{"$f":"IFERROR(VLOOKUP(B27,Entries!$A:$E,5,0),\"-\")","v":"-"},{"$f":"IFERROR(VLOOKUP(B27,Entries!$A:$D,4,0),\"-\")","v":"-"},{"$f":"IFERROR(VLOOKUP(B27,Entries!$A:$H,8,0),\"-\")","v":"-"},{"$f":"IFERROR(VLOOKUP(B27,Entries!$A:$F,6,0),\"-\")","v":"-"},null,null,9,39,{"$f":"IFERROR(VLOOKUP(J27,Entries!$A:$E,5,0),\"-\")","v":"Angeli"},{"$f":"IFERROR(VLOOKUP(J27,Entries!$A:$D,4,0),\"-\")","v":"Eleanor"},{"$f":"IFERROR(VLOOKUP(J27,Entries!$A:$H,8,0),\"-\")","v":14},{"$f":"IFERROR(VLOOKUP(J27,Entries!$A:$F,6,0),\"-\")","v":"Brentwood Beagles Athletics Club"},"17.22"]
[10,null,{"$f":"IFERROR(VLOOKUP(B28,Entries!$A:$E,5,0),\"-\")","v":"-"},{"$f":"IFERROR(VLOOKUP(B28,Entries!$A:$D,4,0),\"-\")","v":"-"},{"$f":"IFERROR(VLOOKUP(B28,Entries!$A:$H,8,0),\"-\")","v":"-"},{"$f":"IFERROR(VLOOKUP(B28,Entries!$A:$F,6,0),\"-\")","v":"-"},null,null,10,null,{"$f":"IFERROR(VLOOKUP(J28,Entries!$A:$E,5,0),\"-\")","v":"-"},{"$f":"IFERROR(VLOOKUP(J28,Entries!$A:$D,4,0),\"-\")","v":"-"},{"$f":"IFERROR(VLOOKUP(J28,Entries!$A:$H,8,0),\"-\")","v":"-"},{"$f":"IFERROR(VLOOKUP(J28,Entries!$A:$F,6,0),\"-\")","v":"-"}]
[]
[]
["U17 Men",null,null,null,null,null,null,null,"U17 Women"]
["Pos","Number","Last Name","First Name","Age","Club","Distance",null,"Pos","Number","Last Name","First Name","Age","Club","Distance"]
[1,153,{"$f":"IFERROR(VLOOKUP(B33,Entries!$A:$E,5,0),\"-\")","v":"Jerman"},{"$f":"IFERROR(VLOOKUP(B33,Entries!$A:$D,4,0),\"-\")","v":"Oscar"},{"$f":"IFERROR(VLOOKUP(B33,Entries!$A:$H,8,0),\"-\")","v":15},{"$f":"IFERROR(VLOOKUP(B33,Entries!$A:$F,6,0),\"-\")","v":"City Of Norwich AC"},"33.87",null,1,147,{"$f":"IFERROR(VLOOKUP(J33,Entries!$A:$E,5,0),\"-\")","v":"Hewitt"},{"$f":"IFERROR(VLOOKUP(J33,Entries!$A:$D,4,0),\"-\")","v":"Matilda"},{"$f":"IFERROR(VLOOKUP(J33,Entries!$A:$H,8,0),\"-\")","v":15},{"$f":"IFERROR(VLOOKUP(J33,Entries!$A:$F,6,0),\"-\")","v":"Chelmsford AC"},"29.77"]
[2,183,{"$f":"IFERROR(VLOOKUP(B34,Entries!$A:$E,5,0),\"-\")","v":"Williams"},{"$f":"IFERROR(VLOOKUP(B34,Entries!$A:$D,4,0),\"-\")","v":"Zak"},{"$f":"IFERROR(VLOOKUP(B34,Entries!$A:$H,8,0),\"-\")","v":15},{"$f":"IFERROR(VLOOKUP(B34,Entries!$A:$F,6,0),\"-\")","v":"Havering AC"},"29.83",null,2,357,{"$f":"IFERROR(VLOOKUP(J34,Entries!$A:$E,5,0),\"-\")","v":"Verilllo"},{"$f":"IFERROR(VLOOKUP(J34,Entries!$A:$D,4,0),\"-\")","v":"Maddie"},{"$f":"IFERROR(VLOOKUP(J34,Entries!$A:$H,8,0),\"-\")","v":16},{"$f":"IFERROR(VLOOKUP(J34,Entries!$A:$F,6,0),\"-\")","v":"Unattached"},"22.96"]
[3,null,{"$f":"IFERROR(VLOOKUP(B35,Entries!$A:$E,5,0),\"-\")","v":"-"},{"$f":"IFERROR(VLOOKUP(B35,Entries!$A:$D,4,0),\"-\")","v":"-"},{"$f":"IFERROR(VLOOKUP(B35,Entries!$A:$H,8,0),\"-\")","v":"-"},{"$f":"IFERROR(VLOOKUP(B35,Entries!$A:$F,6,0),\"-\")","v":"-"},null,null,3,211,{"$f":"IFERROR(VLOOKUP(J35,Entries!$A:$E,5,0),\"-\")","v":"Maskell"},{"$f":"IFERROR(VLOOKUP(J35,Entries!$A:$D,4,0),\"-\")","v":"Freya"},{"$f":"IFERROR(VLOOKUP(J35,Entries!$A:$H,8,0),\"-\")","v":15},{"$f":"IFERROR(VLOOKUP(J35,Entries!$A:$F,6,0),\"-\")","v":"City of Southend On Sea AC"},"21.66"]
[4,null,{"$f":"IFERROR(VLOOKUP(B36,Entries!$A:$E,5,0),\"-\")","v":"-"},{"$f":"IFERROR(VLOOKUP(B36,Entries!$A:$D,4,0),\"-\")","v":"-"},{"$f":"IFERROR(VLOOKUP(B36,Entries!$A:$H,8,0),\"-\")","v":"-"},{"$f":"IFERROR(VLOOKUP(B36,Entries!$A:$F,6,0),\"-\")","v":"-"},null,null,4,233,{"$f":"IFERROR(VLOOKUP(J36,Entries!$A:$E,5,0),\"-\")","v":"Oladele"},{"$f":"IFERROR(VLOOKUP(J36,Entries!$A:$D,4,0),\"-\")","v":"Dasia"},{"$f":"IFERROR(VLOOKUP(J36,Entries!$A:$H,8,0),\"-\")","v":15},{"$f":"IFERROR(VLOOKUP(J36,Entries!$A:$F,6,0),\"-\")","v":"Thurrock Harriers"},"20.03"]
[5,null,{"$f":"IFERROR(VLOOKUP(B37,Entries!$A:$E,5,0),\"-\")","v":"-"},{"$f":"IFERROR(VLOOKUP(B37,Entries!$A:$D,4,0),\"-\")","v":"-"},{"$f":"IFERROR(VLOOKUP(B37,Entries!$A:$H,8,0),\"-\")","v":"-"},{"$f":"IFERROR(VLOOKUP(B37,Entries!$A:$F,6,0),\"-\")","v":"-"},null,null,5,null,{"$f":"IFERROR(VLOOKUP(J37,Entries!$A:$E,5,0),\"-\")","v":"-"},{"$f":"IFERROR(VLOOKUP(J37,Entries!$A:$D,4,0),\"-\")","v":"-"},{"$f":"IFERROR(VLOOKUP(J37,Entries!$A:$H,8,0),\"-\")","v":"-"},{"$f":"IFERROR(VLOOKUP(J37,Entries!$A:$F,6,0),\"-\")","v":"-"}]
[6,null,{"$f":"IFERROR(VLOOKUP(B38,Entries!$A:$E,5,0),\"-\")","v":"-"},{"$f":"IFERROR(VLOOKUP(B38,Entries!$A:$D,4,0),\"-\")","v":"-"},{"$f":"IFERROR(VLOOKUP(B38,Entries!$A:$H,8,0),\"-\")","v":"-"},{"$f":"IFERROR(VLOOKUP(B38,Entries!$A:$F,6,0),\"-\")","v":"-"},null,null,6,null,{"$f":"IFERROR(VLOOKUP(J38,Entries!$A:$E,5,0),\"-\")","v":"-"},{"$f":"IFERROR(VLOOKUP(J38,Entries!$A:$D,4,0),\"-\")","v":"-"},{"$f":"IFERROR(VLOOKUP(J38,Entries!$A:$H,8,0),\"-\")","v":"-"},{"$f":"IFERROR(VLOOKUP(J38,Entries!$A:$F,6,0),\"-\")","v":"-"}]
[7,null,{"$f":"IFERROR(VLOOKUP(B39,Entries!$A:$E,5,0),\"-\")","v":"-"},{"$f":"IFERROR(VLOOKUP(B39,Entries!$A:$D,4,0),\"-\")","v":"-"},{"$f":"IFERROR(VLOOKUP(B39,Entries!$A:$H,8,0),\"-\")","v":"-"},{"$f":"IFERROR(VLOOKUP(B39,Entries!$A:$F,6,0),\"-\")","v":"-"},null,null,7,null,{"$f":"IFERROR(VLOOKUP(J39,Entries!$A:$E,5,0),\"-\")","v":"-"},{"$f":"IFERROR(VLOOKUP(J39,Entries!$A:$D,4,0),\"-\")","v":"-"},{"$f":"IFERROR(VLOOKUP(J39,Entries!$A:$H,8,0),\"-\")","v":"-"},{"$f":"IFERROR(VLOOKUP(J39,Entries!$A:$F,6,0),\"-\")","v":"-"}]
[8,null,{"$f":"IFERROR(VLOOKUP(B40,Entries!$A:$E,5,0),\"-\")","v":"-"},{"$f":"IFERROR(VLOOKUP(B40,Entries!$A:$D,4,0),\"-\")","v":"-"},{"$f":"IFERROR(VLOOKUP(B40,Entries!$A:$H,8,0),\"-\")","v":"-"},{"$f":"IFERROR(VLOOKUP(B40,Entries!$A:$F,6,0),\"-\")","v":"-"},null,null,8,null,{"$f":"IFERROR(VLOOKUP(J40,Entries!$A:$E,5,0),\"-\")","v":"-"},{"$f":"IFERROR(VLOOKUP(J40,Entries!$A:$D,4,0),\"-\")","v":"-"},{"$f":"IFERROR(VLOOKUP(J40,Entries!$A:$H,8,0),\"-\")","v":"-"},{"$f":"IFERROR(VLOOKUP(J40,Entries!$A:$F,6,0),\"-\")","v":"-"}]
[9,null,{"$f":"IFERROR(VLOOKUP(B41,Entries!$A:$E,5,0),\"-\")","v":"-"},{"$f":"IFERROR(VLOOKUP(B41,Entries!$A:$D,4,0),\"-\")","v":"-"},{"$f":"IFERROR(VLOOKUP(B41,Entries!$A:$H,8,0),\"-\")","v":"-"},{"$f":"IFERROR(VLOOKUP(B41,Entries!$A:$F,6,0),\"-\")","v":"-"},null,null,9,null,{"$f":"IFERROR(VLOOKUP(J41,Entries!$A:$E,5,0),\"-\")","v":"-"},{"$f":"IFERROR(VLOOKUP(J41,Entries!$A:$D,4,0),\"-\")","v":"-"},{"$f":"IFERROR(VLOOKUP(J41,Entries!$A:$H,8,0),\"-\")","v":"-"},{"$f":"IFERROR(VLOOKUP(J41,Entries!$A:$F,6,0),\"-\")","v":"-"}]
[10,null,{"$f":"IFERROR(VLOOKUP(B42,Entries!$A:$E,5,0),\"-\")","v":"-"},{"$f":"IFERROR(VLOOKUP(B42,Entries!$A:$D,4,0),\"-\")","v":"-"},{"$f":"IFERROR(VLOOKUP(B42,Entries!$A:$H,8,0),\"-\")","v":"-"},{"$f":"IFERROR(VLOOKUP(B42,Entries!$A:$F,6,0),\"-\")","v":"-"},null,null,10,null,{"$f":"IFERROR(VLOOKUP(J42,Entries!$A:$E,5,0),\"-\")","v":"-"},{"$f":"IFERROR(VLOOKUP(J42,Entries!$A:$D,4,0),\"-\")","v":"-"},{"$f":"IFERROR(VLOOKUP(J42,Entries!$A:$H,8,0),\"-\")","v":"-"},{"$f":"IFERROR(VLOOKUP(J42,Entries!$A:$F,6,0),\"-\")","v":"-"}]
[]
[]
[null,null,null,null,null,null,null,null,"U20 Women"]
[null,null,null,null,null,null,null,null,"Pos","Number","Last Name","First Name","Age","Club","Distance"]
[null,null,null,null,null,null,null,null,1,36,{"$f":"IFERROR(VLOOKUP(J47,Entries!$A:$E,5,0),\"-\")","v":"Delea"},{"$f":"IFERROR(VLOOKUP(J47,Entries!$A:$D,4,0),\"-\")","v":"Erin"},{"$f":"IFERROR(VLOOKUP(J47,Entries!$A:$H,8,0),\"-\")","v":17},{"$f":"IFERROR(VLOOKUP(J47,Entries!$A:$F,6,0),\"-\")","v":"Chelmsford AC"},"36.50"]
[null,null,null,null,null,null,null,null,2,17,{"$f":"IFERROR(VLOOKUP(J48,Entries!$A:$E,5,0),\"-\")","v":"Ennis"},{"$f":"IFERROR(VLOOKUP(J48,Entries!$A:$D,4,0),\"-\")","v":"Katie"},{"$f":"IFERROR(VLOOKUP(J48,Entries!$A:$H,8,0),\"-\")","v":19},{"$f":"IFERROR(VLOOKUP(J48,Entries!$A:$F,6,0),\"-\")","v":"Havering AC"},"34.14"]
[null,null,null,null,null,null,null,null,3,null,{"$f":"IFERROR(VLOOKUP(J49,Entries!$A:$E,5,0),\"-\")","v":"-"},{"$f":"IFERROR(VLOOKUP(J49,Entries!$A:$D,4,0),\"-\")","v":"-"},{"$f":"IFERROR(VLOOKUP(J49,Entries!$A:$H,8,0),\"-\")","v":"-"},{"$f":"IFERROR(VLOOKUP(J49,Entries!$A:$F,6,0),\"-\")","v":"-"}]
[null,null,null,null,null,null,null,null,4,null,{"$f":"IFERROR(VLOOKUP(J50,Entries!$A:$E,5,0),\"-\")","v":"-"},{"$f":"IFERROR(VLOOKUP(J50,Entries!$A:$D,4,0),\"-\")","v":"-"},{"$f":"IFERROR(VLOOKUP(J50,Entries!$A:$H,8,0),\"-\")","v":"-"},{"$f":"IFERROR(VLOOKUP(J50,Entries!$A:$F,6,0),\"-\")","v":"-"}]
[null,null,null,null,null,null,null,null,5,null,{"$f":"IFERROR(VLOOKUP(J51,Entries!$A:$E,5,0),\"-\")","v":"-"},{"$f":"IFERROR(VLOOKUP(J51,Entries!$A:$D,4,0),\"-\")","v":"-"},{"$f":"IFERROR(VLOOKUP(J51,Entries!$A:$H,8,0),\"-\")","v":"-"},{"$f":"IFERROR(VLOOKUP(J51,Entries!$A:$F,6,0),\"-\")","v":"-"}]
[null,null,null,null,null,null,null,null,6,null,{"$f":"IFERROR(VLOOKUP(J52,Entries!$A:$E,5,0),\"-\")","v":"-"},{"$f":"IFERROR(VLOOKUP(J52,Entries!$A:$D,4,0),\"-\")","v":"-"},{"$f":"IFERROR(VLOOKUP(J52,Entries!$A:$H,8,0),\"-\")","v":"-"},{"$f":"IFERROR(VLOOKUP(J52,Entries!$A:$F,6,0),\"-\")","v":"-"}]
[null,null,null,null,null,null,null,null,7,null,{"$f":"IFERROR(VLOOKUP(J53,Entries!$A:$E,5,0),\"-\")","v":"-"},{"$f":"IFERROR(VLOOKUP(J53,Entries!$A:$D,4,0),\"-\")","v":"-"},{"$f":"IFERROR(VLOOKUP(J53,Entries!$A:$H,8,0),\"-\")","v":"-"},{"$f":"IFERROR(VLOOKUP(J53,Entries!$A:$F,6,0),\"-\")","v":"-"}]
[null,null,null,null,null,null,null,null,8,null,{"$f":"IFERROR(VLOOKUP(J54,Entries!$A:$E,5,0),\"-\")","v":"-"},{"$f":"IFERROR(VLOOKUP(J54,Entries!$A:$D,4,0),\"-\")","v":"-"},{"$f":"IFERROR(VLOOKUP(J54,Entries!$A:$H,8,0),\"-\")","v":"-"},{"$f":"IFERROR(VLOOKUP(J54,Entries!$A:$F,6,0),\"-\")","v":"-"}]
[null,null,null,null,null,null,null,null,9,null,{"$f":"IFERROR(VLOOKUP(J55,Entries!$A:$E,5,0),\"-\")","v":"-"},{"$f":"IFERROR(VLOOKUP(J55,Entries!$A:$D,4,0),\"-\")","v":"-"},{"$f":"IFERROR(VLOOKUP(J55,Entries!$A:$H,8,0),\"-\")","v":"-"},{"$f":"IFERROR(VLOOKUP(J55,Entries!$A:$F,6,0),\"-\")","v":"-"}]
[null,null,null,null,null,null,null,null,10,null,{"$f":"IFERROR(VLOOKUP(J56,Entries!$A:$E,5,0),\"-\")","v":"-"},{"$f":"IFERROR(VLOOKUP(J56,Entries!$A:$D,4,0),\"-\")","v":"-"},{"$f":"IFERROR(VLOOKUP(J56,Entries!$A:$H,8,0),\"-\")","v":"-"},{"$f":"IFERROR(VLOOKUP(J56,Entries!$A:$F,6,0),\"-\")","v":"-"}]
[]
[]
["Senior Men"]
["Pos","Number","Last Name","First Name","Age","Club","Distance"]
[1,287,{"$f":"IFERROR(VLOOKUP(B61,Entries!$A:$E,5,0),\"-\")","v":"Praim-Singh"},{"$f":"IFERROR(VLOOKUP(B61,Entries!$A:$D,4,0),\"-\")","v":"Billy"},{"$f":"IFERROR(VLOOKUP(B61,Entries!$A:$H,8,0),\"-\")","v":25},{"$f":"IFERROR(VLOOKUP(B61,Entries!$A:$F,6,0),\"-\")","v":"City of Southend On Sea AC"},"34.56"]
[2,282,{"$f":"IFERROR(VLOOKUP(B62,Entries!$A:$E,5,0),\"-\")","v":"York"},{"$f":"IFERROR(VLOOKUP(B62,Entries!$A:$D,4,0),\"-\")","v":"Aaron"},{"$f":"IFERROR(VLOOKUP(B62,Entries!$A:$H,8,0),\"-\")","v":28},{"$f":"IFERROR(VLOOKUP(B62,Entries!$A:$F,6,0),\"-\")","v":"Basildon AC"},"31.09"]
[3,279,{"$f":"IFERROR(VLOOKUP(B63,Entries!$A:$E,5,0),\"-\")","v":"Young"},{"$f":"IFERROR(VLOOKUP(B63,Entries!$A:$D,4,0),\"-\")","v":"Jake"},{"$f":"IFERROR(VLOOKUP(B63,Entries!$A:$H,8,0),\"-\")","v":34},{"$f":"IFERROR(VLOOKUP(B63,Entries!$A:$F,6,0),\"-\")","v":"SS Athletics"},"23.36"]
[4,null,{"$f":"IFERROR(VLOOKUP(B64,Entries!$A:$E,5,0),\"-\")","v":"-"},{"$f":"IFERROR(VLOOKUP(B64,Entries!$A:$D,4,0),\"-\")","v":"-"},{"$f":"IFERROR(VLOOKUP(B64,Entries!$A:$H,8,0),\"-\")","v":"-"},{"$f":"IFERROR(VLOOKUP(B64,Entries!$A:$F,6,0),\"-\")","v":"-"}]
[5,null,{"$f":"IFERROR(VLOOKUP(B65,Entries!$A:$E,5,0),\"-\")","v":"-"},{"$f":"IFERROR(VLOOKUP(B65,Entries!$A:$D,4,0),\"-\")","v":"-"},{"$f":"IFERROR(VLOOKUP(B65,Entries!$A:$H,8,0),\"-\")","v":"-"},{"$f":"IFERROR(VLOOKUP(B65,Entries!$A:$F,6,0),\"-\")","v":"-"}]
[6,null,{"$f":"IFERROR(VLOOKUP(B66,Entries!$A:$E,5,0),\"-\")","v":"-"},{"$f":"IFERROR(VLOOKUP(B66,Entries!$A:$D,4,0),\"-\")","v":"-"},{"$f":"IFERROR(VLOOKUP(B66,Entries!$A:$H,8,0),\"-\")","v":"-"},{"$f":"IFERROR(VLOOKUP(B66,Entries!$A:$F,6,0),\"-\")","v":"-"}]
[7,null,{"$f":"IFERROR(VLOOKUP(B67,Entries!$A:$E,5,0),\"-\")","v":"-"},{"$f":"IFERROR(VLOOKUP(B67,Entries!$A:$D,4,0),\"-\")","v":"-"},{"$f":"IFERROR(VLOOKUP(B67,Entries!$A:$H,8,0),\"-\")","v":"-"},{"$f":"IFERROR(VLOOKUP(B67,Entries!$A:$F,6,0),\"-\")","v":"-"}]
[8,null,{"$f":"IFERROR(VLOOKUP(B68,Entries!$A:$E,5,0),\"-\")","v":"-"},{"$f":"IFERROR(VLOOKUP(B68,Entries!$A:$D,4,0),\"-\")","v":"-"},{"$f":"IFERROR(VLOOKUP(B68,Entries!$A:$H,8,0),\"-\")","v":"-"},{"$f":"IFERROR(VLOOKUP(B68,Entries!$A:$F,6,0),\"-\")","v":"-"}]
[9,null,{"$f":"IFERROR(VLOOKUP(B69,Entries!$A:$E,5,0),\"-\")","v":"-"},{"$f":"IFERROR(VLOOKUP(B69,Entries!$A:$D,4,0),\"-\")","v":"-"},{"$f":"IFERROR(VLOOKUP(B69,Entries!$A:$H,8,0),\"-\")","v":"-"},{"$f":"IFERROR(VLOOKUP(B69,Entries!$A:$F,6,0),\"-\")","v":"-"}]
[10,null,{"$f":"IFERROR(VLOOKUP(B70,Entries!$A:$E,5,0),\"-\")","v":"-"},{"$f":"IFERROR(VLOOKUP(B70,Entries!$A:$D,4,0),\"-\")","v":"-"},{"$f":"IFERROR(VLOOKUP(B70,Entries!$A:$H,8,0),\"-\")","v":"-"},{"$f":"IFERROR(VLOOKUP(B70,Entries!$A:$F,6,0),\"-\")","v":"-"}]
[]
[]
[null,null,null,null,null,null,null,null,"Veteran Women"]
[null,null,null,null,null,null,null,null,"Pos","Number","Last Name","First Name","Age","Club","Distance"]
[null,null,null,null,null,null,null,null,1,139,{"$f":"IFERROR(VLOOKUP(J75,Entries!$A:$E,5,0),\"-\")","v":"Norton"},{"$f":"IFERROR(VLOOKUP(J75,Entries!$A:$D,4,0),\"-\")","v":"Sarah"},{"$f":"IFERROR(VLOOKUP(J75,Entries!$A:$H,8,0),\"-\")","v":52},{"$f":"IFERROR(VLOOKUP(J75,Entries!$A:$F,6,0),\"-\")","v":"Castle Point Joggers"},"13.08"]
[null,null,null,null,null,null,null,null,null,null,{"$f":"IFERROR(VLOOKUP(J76,Entries!$A:$E,5,0),\"-\")","v":"-"},{"$f":"IFERROR(VLOOKUP(J76,Entries!$A:$D,4,0),\"-\")","v":"-"},{"$f":"IFERROR(VLOOKUP(J76,Entries!$A:$H,8,0),\"-\")","v":"-"},{"$f":"IFERROR(VLOOKUP(J76,Entries!$A:$F,6,0),\"-\")","v":"-"}]
[null,null,null,null,null,null,null,null,null,null,{"$f":"IFERROR(VLOOKUP(J77,Entries!$A:$E,5,0),\"-\")","v":"-"},{"$f":"IFERROR(VLOOKUP(J77,Entries!$A:$D,4,0),\"-\")","v":"-"},{"$f":"IFERROR(VLOOKUP(J77,Entries!$A:$H,8,0),\"-\")","v":"-"},{"$f":"IFERROR(VLOOKUP(J77,Entries!$A:$F,6,0),\"-\")","v":"-"}]
[null,null,null,null,null,null,null,null,1,13,{"$f":"IFERROR(VLOOKUP(J78,Entries!$A:$E,5,0),\"-\")","v":"Stamp"},{"$f":"IFERROR(VLOOKUP(J78,Entries!$A:$D,4,0),\"-\")","v":"Stephanie"},{"$f":"IFERROR(VLOOKUP(J78,Entries!$A:$H,8,0),\"-\")","v":72},{"$f":"IFERROR(VLOOKUP(J78,Entries!$A:$F,6,0),\"-\")","v":"City of Southend On Sea AC"},"12.10"]
[null,null,null,null,null,null,null,null,null,null,{"$f":"IFERROR(VLOOKUP(J79,Entries!$A:$E,5,0),\"-\")","v":"-"},{"$f":"IFERROR(VLOOKUP(J79,Entries!$A:$D,4,0),\"-\")","v":"-"},{"$f":"IFERROR(VLOOKUP(J79,Entries!$A:$H,8,0),\"-\")","v":"-"},{"$f":"IFERROR(VLOOKUP(J79,Entries!$A:$F,6,0),\"-\")","v":"-"}]
[null,null,null,null,null,null,null,null,null,null,{"$f":"IFERROR(VLOOKUP(J80,Entries!$A:$E,5,0),\"-\")","v":"-"},{"$f":"IFERROR(VLOOKUP(J80,Entries!$A:$D,4,0),\"-\")","v":"-"},{"$f":"IFERROR(VLOOKUP(J80,Entries!$A:$H,8,0),\"-\")","v":"-"},{"$f":"IFERROR(VLOOKUP(J80,Entries!$A:$F,6,0),\"-\")","v":"-"}]
[null,null,null,null,null,null,null,null,null,null,{"$f":"IFERROR(VLOOKUP(J81,Entries!$A:$E,5,0),\"-\")","v":"-"},{"$f":"IFERROR(VLOOKUP(J81,Entries!$A:$D,4,0),\"-\")","v":"-"},{"$f":"IFERROR(VLOOKUP(J81,Entries!$A:$H,8,0),\"-\")","v":"-"},{"$f":"IFERROR(VLOOKUP(J81,Entries!$A:$F,6,0),\"-\")","v":"-"}]
[null,null,null,null,null,null,null,null,null,null,{"$f":"IFERROR(VLOOKUP(J82,Entries!$A:$E,5,0),\"-\")","v":"-"},{"$f":"IFERROR(VLOOKUP(J82,Entries!$A:$D,4,0),\"-\")","v":"-"},{"$f":"IFERROR(VLOOKUP(J82,Entries!$A:$H,8,0),\"-\")","v":"-"},{"$f":"IFERROR(VLOOKUP(J82,Entries!$A:$F,6,0),\"-\")","v":"-"}]
[null,null,null,null,null,null,null,null,null,null,{"$f":"IFERROR(VLOOKUP(J83,Entries!$A:$E,5,0),\"-\")","v":"-"},{"$f":"IFERROR(VLOOKUP(J83,Entries!$A:$D,4,0),\"-\")","v":"-"},{"$f":"IFERROR(VLOOKUP(J83,Entries!$A:$H,8,0),\"-\")","v":"-"},{"$f":"IFERROR(VLOOKUP(J83,Entries!$A:$F,6,0),\"-\")","v":"-"}]
[null,null,null,null,null,null,null,null,null,null,{"$f":"IFERROR(VLOOKUP(J84,Entries!$A:$E,5,0),\"-\")","v":"-"},{"$f":"IFERROR(VLOOKUP(J84,Entries!$A:$D,4,0),\"-\")","v":"-"},{"$f":"IFERROR(VLOOKUP(J84,Entries!$A:$H,8,0),\"-\")","v":"-"},{"$f":"IFERROR(VLOOKUP(J84,Entries!$A:$F,6,0),\"-\")","v":"-"}]